精华内容
下载资源
问答
  • npm安装appium报错: Error installing Chromedriver: Request failed with status code 404 [16:16:30] Error: Request failed with status code 404 ] appium-android-driver@4.43.1 › appium-chromedriver@^...

    npm安装appium报错:

    Error installing Chromedriver: Request failed with status code 404
    [16:16:30] Error: Request failed with status code 404

    ] appium-android-driver@4.43.1 › appium-chromedriver@^4.13.0 scripts.postinstall run "node install-npm.js" error: Error [RunScriptError]:

    Install fail! RunScriptError: post install error, please remove node_modules before retry!
    Run "C:\Windows\system32\cmd.exe /d /s /c node install-npm.js" error, exit code 1

     

    解决办法:先删除npm下面的node_modules的东西,

    然后执行下面的命令:

    npm config set registry https://registry.npm.taobao.org

    npm install appium -g --chromedriver_cdnurl=http://cdn.npm.taobao.org/dist/chromedriver

    展开全文
  • babel报错

    2020-07-15 17:39:04
    npm运行项目报错----Cannot find module '@babel/compat-data/corejs3-shipped-proposals' 第二种方法: npminstall-Dbabel-loader@babel/core@babel/preset-envwebpack

    npm运行项目报错----Cannot find module '@babel/compat-data/corejs3-shipped-proposals'

     

    第二种方法:

    npm install -D babel-loader @babel/core @babel/preset-env webpack

    展开全文
  • npminstall-gnode-gyp 然后再npm install npm install 然后就成功了。 我的报错: 首次npm install的结果: 然后运行就会报错: 解决方案: 1.npm install -g node-gyp 2.npm install 3.npm run ...

    首次npm install的时候报错,不成功,

    可以在npm install 之前先进行这一步

    npm install -g node-gyp

    然后再npm install

    npm install

    然后就成功了。

    我的报错:

    首次npm install的结果:

    然后运行就会报错:

    解决方案:

    1.npm install -g node-gyp

    2.npm install

    3.npm run serve

    就解决啦

    展开全文
  • npm install 报错解决

    万次阅读 2018-03-11 09:21:38
    (24612 bytes) 查了一翻资料应该是npm版本过低问题,于是执行'npm install -g npm'命令升级版本,然后在执行安装'npm install -g cnpm --registry=https://registry.npm.taobao.org',报错如下: npm ERR!...

    npm安装cnpm时报各种关于package.json的解析错误,经过多次使用'npm cache clean --force'命令清除缓存再安装后最终报如下错误:

    npm ERR! code EINTEGRITY
    npm ERR! sha1-wgdX/nLucSeOoP89h+XCyjDZ7fg= integrity checksum failed when using sha1: wanted sha1-wgdX/nLucSeOoP89h+XCyjDZ7fg= but got sha1-Qfc3yuL3VpD7S/vTCTybJry8+uE=. (24612 bytes)

    查了一翻资料应该是npm版本过低问题,于是执行'npm install -g npm'命令升级版本,然后在执行安装'npm install -g cnpm --registry=https://registry.npm.taobao.org',报错如下:

    npm ERR! code EINTEGRITY
    npm ERR! Verification failed while extracting node-gyp@^3.6.2:
    npm ERR! sha1-m/vlRWIoYoSDjnUOrAUpWFP6HGA= integrity checksum failed when using sha1: wanted sha1-m/vlRWIoYoSDjnUOrAUpWFP6HGA= but got sha512-qCYQ3agDYou0MZbXfVkt6zvzbXQxJuocoAs4MTbef1+p19dMXfu8Ep/JHMnMHs3JlxDYr9XvALnbh68pHth9UA== sha1-Q+d4hbpuN1jlIc+qNkie7y+jLw0=. (40579 bytes)

    然后再执行'npm cache clean --force'清缓存再安装,再清缓存再安装.....反复几次后,终于安装成功。胜利的提示如下:

    C:\Windows\System32>npm install -g cnpm --registry=https://registry.npm.taobao.org
    C:\Users\lxz\AppData\Roaming\npm\cnpm -> C:\Users\lxz\AppData\Roaming\npm\node_modules\cnpm\bin\cnpm
    + cnpm@5.2.0
    added 778 packages from 772 contributors in 161.031s

    至于为什么要反复清缓存再安装呢?我也没清楚,反正发现每次清缓存再安装报的错误都会不一样,所以反复尝试了几次就ok了

    展开全文
  • Vue报错

    2017-10-14 19:42:00
    Node Sass could not find a binding for your current environment: OS X 64-bit with Node.js 8.x Found bindings for the following environments: - OS X 64-bit with Node.js 6.x ...npminstall-g n ...
  • 具体报错信息如下 npm ERR!code ELIFECYCLE npm ERR!errno 1 npm ERR!node-sass@4.9.2 postinstall: node scripts/build.js npm ERR!Exit status 1 npm ERRnpm ERR!Failed at the node-sass@4.9.2 postinstall ...
  • npm run dev报错

    2020-05-23 17:54:48
    npm run dev报错 Module build failed: Error: Cannot find module 'node-sass' 缺包导致 npminstall node-sass --save
  • npm install报错

    2021-05-12 23:56:50
    解决办法 先安装npminstall--ignore-scripts再使用npminstall 成功如下图 文章参考于:https://blog.csdn.net/weixin_44346550/article/details/90711478?utm_source=app
  • ionic start myApp 报错

    2017-05-24 22:49:15
    今天回来在家 ionic start myApp 报错: Installing npm packages… Error with start undefined Error Initializing app: There was an error with the spawned command: npminstall There was an error with ...
  • npm install 安装报错解决办法

    千次阅读 2019-07-09 12:31:04
    npm install 安装报错解决办法报错——operation not permitted(没有许可证)报错——Missing: chromedriver报其他错误降低npm版本写在后面 报错——operation not permitted(没有许可证) 【原因】npm的版本过高...
  • 1.为什么会报错? 这里报错是因为babel的版本冲突。 官方文档注明:babel-loader 8.x | babel 7.x npminstall-Dbabel-loader@babel/core@babel/preset-env babel-loader 7.x | babel 6.x npminstall-Dbabel-...
  • npm install 报错

    千次阅读 2018-01-03 15:01:42
    nodejs和npm都是之前就装了的,今天想启动项目,发现bower还未安装,于是在控制台输入 npm install 报错了: 又输入 npm install bower,还是报错: 这次应该是网络的问题,大概是连不上npm
  • angular2报错

    2018-08-19 17:21:00
    1、运行ng serve的时候卡在95% emitting LicenseWebpackPlugin 放弃使用cnpm,使用yarn ...安装yarn:npminstall --globalyarn 配置仓库: npm config set registryhttp://registry.npmjs.org...
  • npm install 报错踩坑路 先出现的是超过最大调用栈问题: npm ERR! Maximum call stack size exceeded 百度之后说给npm降级或者升级 降级 : npm install -g npm@5.4.0 升级 : npm install -g npm 升级到最新版 ...
  • npminstall-ggulp 结果报错: EACCES:permissiondenied,mkdir'/usr/local/lib/node_modules/gulp/node_module... 类似这种错误的原因是执行命令时没有获得管理员权限 解决方法:在命令前面加上su...
  • Installing npm packages......Error Initializing app: There was an error with the spawned command: npminstall There was an error with the spawned command: npminstall Caught exception: undefined
  • npm install报错解决方案

    千次阅读 2020-08-10 16:53:03
    如果使用npm install报错,或者卡着不动的情况下(比如TimeOut) 可以试试cnpm来安装,首先配置镜像源,采用淘宝镜像源 第一步: npm install -g cnpm --registry=https://registry.npm.taobao.org 第二部: cnpm ...
  • npm安装 node-sass报错

    2020-10-19 13:40:07
    在使用npm安装node-sass的时候,可能会出现如下的报错: Error: ENOENT: no such file or directory, scandir ‘D:\IdeaWork\code-front-jet\node_modules.npminstall\node-sass\3.7.0\node-sass\vendor’ at Error ...
  • Mac系统安装npm报错

    2020-11-02 19:26:19
    Mac系统安装npm报错 问题: 打开终端输入 npm install -g cnpm --registry=https://registry.npm.taobao.org 然后出现以下报错: npm WARN deprecated request@2.88.2: request has been deprecated, see ...
  • npm install 报错踩坑路 先出现的是超过最大调用栈问题: npm ERR! Maximum call stack size exceeded 百度说给npm降级或者升级 降级 : npm install -g npm@5.4.0 升级 : npm install -g npm 升级到最新版 npm...
  • 执行 npm install 初始化时 chromedriver 报错: npm ERR! chromedriver@2.46.0 install: `node install.js` 解决办法:执行 npm install --ignore-scripts 再重新执行 npm install
  • 1,新搭建的环境,node版本,npm版本,Vue-cli版本...2,之后npm i就报错如下: npm ERR! path git npm ERR! code ENOENT npm ERR! errno ENOENT npm ERR! syscall spawn git npm ERR! enoent Error while executing...
  • windows下运行报错

    2020-12-26 06:05:55
    (E:\MyProject\bishe\boke\jackblog-api-koa\node_modules.npminstall\ccap\0.6.4\ccap\lib\hcap.js:4:13) at Module._compile (module.js:409:26) at Object.Module._extensions..js (module.js:416:10) at ...
  • 在启动vue项目的时候报错 报错信息如下: npm ERR! code ELIFECYCLE npm ERR! errno 1 npm ERR! node-sass@4.14.1 postinstall: `node scripts/build.js` npm ERR! Exit status 1 npm ERR! npm ERR! Failed at the...
  • Mac 上 npm install 报错

    千次阅读 2019-04-30 16:45:20
    克隆好项目后,使用npm install ,有如下报错 是permission 的问题。 我们按照如下的步骤操作一下吧,哎。 - 新建一个文件 mkdir ~/.npm-global - 设置npm 使用新的路径 npm config set prefix '~/.npm-...
  • npm install报错

    2021-01-25 14:18:22
    D:\Program Files (x86)\nodejs\npm-cache\_logs\2021-01-25T05_52_30_965Z-debug.log 原因:我的原因是因为后端tomcat把8080给占用了,所以install会报错 解决办法:将后端tomcat给停了,然后install就解决了

空空如也

空空如也

1 2 3 4 5 ... 20
收藏数 617
精华内容 246
关键字:

npminstall报错