精华内容
下载资源
问答
  • Zxing BarcodeFormat.RSS14 出错

    千次阅读 2014-11-10 17:03:30
    使用别人生成的Zxing 的时候可能会出现找不到BarcodeFormat.RSS14 这个变量。直接把BarcodeFormat.RSS14改成BarcodeFormat.RSS_14
    使用别人生成的Zxing 的时候可能会出现找不到BarcodeFormat.RSS14 这个变量。直接把BarcodeFormat.RSS14改成BarcodeFormat.RSS_14就可以了
    
    展开全文
  • , out BarcodeFormat format)</code></p> <p>returns false. It should return true with the format variable filled with the BarcodeFormat.ALL_1D value. It works correctly with all the other recognized ...
  • 导入ZXing源码后,有时会出现PRODUCT_FORMATS.add(BarcodeFormat.RSS14);报错。 解决方法,将该句改为PRODUCT_FORMATS.add(BarcodeFormat.RSS_14);
    导入ZXing源码后,有时会出现PRODUCT_FORMATS.add(BarcodeFormat.RSS14);报错。
    解决方法,将该句改为PRODUCT_FORMATS.add(BarcodeFormat.RSS_14);
    展开全文
  • Error: Program type already present: com.google.zxing.BarcodeFormat Caused by: java.lang.RuntimeException: com.android.builder.dexing.DexArchiveMergerException: Error while merging dex archiv...

    错误信息:

    Error: Program type already present: com.google.zxing.BarcodeFormat
    
    Caused by: java.lang.RuntimeException: com.android.builder.dexing.DexArchiveMergerException: Error while merging dex archives: H:\AndroidstudioProjects\LovePet\app\build\intermediates\transforms\dexBuilder\debug\0.jar, H:\AndroidstudioProjects\LovePet\app\build\intermediates\transforms\dexBuilder\debug\1.jar, H:\AndroidstudioProjects\LovePet\app\build\intermediates\transforms\dexBuilder\debug\2.jar, H:\AndroidstudioProjects\LovePet\app\build\intermediates\transforms\dexBuilder\debug\3.jar, H:\AndroidstudioProjects\LovePet\app\build\intermediates\transforms\dexBuilder\debug\4.jar, H:\AndroidstudioProjects\LovePet\app\build\intermediates\transforms\dexBuilder\debug\5.jar, H:\AndroidstudioProjects\LovePet\app\build\intermediates\transforms\dexBuilder\debug\6.jar, H:\AndroidstudioProjects\LovePet\app\build\intermediates\transforms\dexBuilder\debug\7.jar, H:\AndroidstudioProjects\LovePet\app\build\intermediates\transforms\dexBuilder\debug\8.jar, H:\AndroidstudioProjects\LovePet\app\build\intermediates\transforms\dexBuilder\debug\9.jar, H:\AndroidstudioProjects\LovePet\app\build\intermediates\transforms\dexBuilder\debug\10.jar, H:\AndroidstudioProjects\LovePet\app\build\intermediates\transforms\dexBuilder\debug\11.jar, H:\AndroidstudioProjects\LovePet\app\build\intermediates\transforms\dexBuilder\debug\12.jar, H:\AndroidstudioProjects\LovePet\app\build\intermediates\transforms\dexBuilder\debug\13.jar, H:\AndroidstudioProjects\LovePet\app\build\intermediates\transforms\dexBuilder\debug\14.jar, H:\AndroidstudioProjects\LovePet\app\build\intermediates\transforms\dexBuilder\debug\15.jar, H:\AndroidstudioProjects\LovePet\app\build\intermediates\transforms\dexBuilder\debug\16.jar, H:\AndroidstudioProjects\LovePet\app\build\intermediates\transforms\dexBuilder\debug\17.jar, H:\AndroidstudioProjects\LovePet\app\build\intermediates\transforms\dexBuilder\debug\18.jar, H:\AndroidstudioProjects\LovePet\app\build\intermediates\transforms\dexBuilder\debug\19.jar, H:\AndroidstudioProjects\LovePet\app\build\intermediates\transforms\dexBuilder\debug\20.jar, H:\AndroidstudioProjects\LovePet\app\build\intermediates\transforms\dexBuilder\debug\21.jar, H:\AndroidstudioProjects\LovePet\app\build\intermediates\transforms\dexBuilder\debug\22.jar, H:\AndroidstudioProjects\LovePet\app\build\intermediates\transforms\dexBuilder\debug\23.jar, H:\AndroidstudioProjects\LovePet\app\build\intermediates\transforms\dexBuilder\debug\24.jar, H:\AndroidstudioProjects\LovePet\app\build\intermediates\transforms\dexBuilder\debug\25.jar, H:\AndroidstudioProjects\LovePet\app\build\intermediates\transforms\dexBuilder\debug\26.jar, H:\AndroidstudioProjects\LovePet\app\build\intermediates\transforms\dexBuilder\debug\27.jar, H:\AndroidstudioProjects\LovePet\app\build\intermediates\transforms\dexBuilder\debug\28.jar, H:\AndroidstudioProjects\LovePet\app\build\intermediates\transforms\dexBuilder\debug\29.jar, H:\AndroidstudioProjects\LovePet\app\build\intermediates\transforms\dexBuilder\debug\30.jar, H:\AndroidstudioProjects\LovePet\app\build\intermediates\transforms\dexBuilder\debug\31.jar, H:\AndroidstudioProjects\LovePet\app\build\intermediates\transforms\dexBuilder\debug\32.jar, H:\AndroidstudioProjects\LovePet\app\build\intermediates\transforms\dexBuilder\debug\33.jar, H:\AndroidstudioProjects\LovePet\app\build\intermediates\transforms\dexBuilder\debug\34.jar, H:\AndroidstudioProjects\LovePet\app\build\intermediates\transforms\dexBuilder\debug\35.jar, H:\AndroidstudioProjects\LovePet\app\build\intermediates\transforms\dexBuilder\debug\36.jar, H:\AndroidstudioProjects\LovePet\app\build\intermediates\transforms\dexBuilder\debug\37.jar, H:\AndroidstudioProjects\LovePet\app\build\intermediates\transforms\dexBuilder\debug\38.jar, H:\AndroidstudioProjects\LovePet\app\build\intermediates\transforms\dexBuilder\debug\39.jar, H:\AndroidstudioProjects\LovePet\app\build\intermediates\transforms\dexBuilder\debug\40.jar, H:\AndroidstudioProjects\LovePet\app\build\intermediates\transforms\dexBuilder\debug\41.jar, H:\AndroidstudioProjects\LovePet\app\build\intermediates\transforms\dexBuilder\debug\42.jar, H:\AndroidstudioProjects\LovePet\app\build\intermediates\transforms\dexBuilder\debug\43.jar, H:\AndroidstudioProjects\LovePet\app\build\intermediates\transforms\dexBuilder\debug\44.jar, H:\AndroidstudioProjects\LovePet\app\build\intermediates\transforms\dexBuilder\debug\45.jar, H:\AndroidstudioProjects\LovePet\app\build\intermediates\transforms\dexBuilder\debug\46.jar, H:\AndroidstudioProjects\LovePet\app\build\intermediates\transforms\dexBuilder\debug\47.jar, H:\AndroidstudioProjects\LovePet\app\build\intermediates\transforms\dexBuilder\debug\48.jar, H:\AndroidstudioProjects\LovePet\app\build\intermediates\transforms\dexBuilder\debug\49.jar, H:\AndroidstudioProjects\LovePet\app\build\intermediates\transforms\dexBuilder\debug\50.jar, H:\AndroidstudioProjects\LovePet\app\build\intermediates\transforms\dexBuilder\debug\51.jar, H:\AndroidstudioProjects\LovePet\app\build\intermediates\transforms\dexBuilder\debug\52.jar, H:\AndroidstudioProjects\LovePet\app\build\intermediates\transforms\dexBuilder\debug\53.jar
    Program type already present: com.google.zxing.BarcodeFormat
    Learn how to resolve the issue at https://developer.android.com/studio/build/dependencies#duplicate_classes.
    	at com.android.builder.profile.Recorder$Block.handleException(Recorder.java:55)
    	at com.android.builder.profile.ThreadRecorder.record(ThreadRecorder.java:104)
    	at com.android.build.gradle.internal.pipeline.TransformTask.transform(TransformTask.java:230)
    	at sun.reflect.GeneratedMethodAccessor684.invoke(Unknown Source)
    	at sun.reflect.DelegatingMethodAccessorImpl.invoke(DelegatingMethodAccessorImpl.java:43)
    	at java.lang.reflect.Method.invoke(Method.java:498)
    	at org.gradle.internal.reflect.JavaMethod.invoke(JavaMethod.java:73)
    	at org.gradle.api.internal.project.taskfactory.IncrementalTaskAction.doExecute(IncrementalTaskAction.java:50)
    	at org.gradle.api.internal.project.taskfactory.StandardTaskAction.execute(StandardTaskAction.java:39)
    	at org.gradle.api.internal.project.taskfactory.StandardTaskAction.execute(StandardTaskAction.java:26)
    	at org.gradle.api.internal.tasks.execution.ExecuteActionsTaskExecuter$1.run(ExecuteActionsTaskExecuter.java:124)
    	at org.gradle.internal.progress.DefaultBuildOperationExecutor$RunnableBuildOperationWorker.execute(DefaultBuildOperationExecutor.java:336)
    	at org.gradle.internal.progress.DefaultBuildOperationExecutor$RunnableBuildOperationWorker.execute(DefaultBuildOperationExecutor.java:328)
    	at org.gradle.internal.progress.DefaultBuildOperationExecutor.execute(DefaultBuildOperationExecutor.java:199)
    	at org.gradle.internal.progress.DefaultBuildOperationExecutor.run(DefaultBuildOperationExecutor.java:110)
    	at org.gradle.api.internal.tasks.execution.ExecuteActionsTaskExecuter.executeAction(ExecuteActionsTaskExecuter.java:113)
    	at org.gradle.api.internal.tasks.execution.ExecuteActionsTaskExecuter.executeActions(ExecuteActionsTaskExecuter.java:95)
    	... 108 more
    Caused by: com.android.builder.dexing.DexArchiveMergerException: Error while merging dex archives: H:\AndroidstudioProjects\LovePet\app\build\intermediates\transforms\dexBuilder\debug\0.jar, H:\AndroidstudioProjects\LovePet\app\build\intermediates\transforms\dexBuilder\debug\1.jar, H:\AndroidstudioProjects\LovePet\app\build\intermediates\transforms\dexBuilder\debug\2.jar, H:\AndroidstudioProjects\LovePet\app\build\intermediates\transforms\dexBuilder\debug\3.jar, H:\AndroidstudioProjects\LovePet\app\build\intermediates\transforms\dexBuilder\debug\4.jar, H:\AndroidstudioProjects\LovePet\app\build\intermediates\transforms\dexBuilder\debug\5.jar, H:\AndroidstudioProjects\LovePet\app\build\intermediates\transforms\dexBuilder\debug\6.jar, H:\AndroidstudioProjects\LovePet\app\build\intermediates\transforms\dexBuilder\debug\7.jar, H:\AndroidstudioProjects\LovePet\app\build\intermediates\transforms\dexBuilder\debug\8.jar, H:\AndroidstudioProjects\LovePet\app\build\intermediates\transforms\dexBuilder\debug\9.jar, H:\AndroidstudioProjects\LovePet\app\build\intermediates\transforms\dexBuilder\debug\10.jar, H:\AndroidstudioProjects\LovePet\app\build\intermediates\transforms\dexBuilder\debug\11.jar, H:\AndroidstudioProjects\LovePet\app\build\intermediates\transforms\dexBuilder\debug\12.jar, H:\AndroidstudioProjects\LovePet\app\build\intermediates\transforms\dexBuilder\debug\13.jar, H:\AndroidstudioProjects\LovePet\app\build\intermediates\transforms\dexBuilder\debug\14.jar, H:\AndroidstudioProjects\LovePet\app\build\intermediates\transforms\dexBuilder\debug\15.jar, H:\AndroidstudioProjects\LovePet\app\build\intermediates\transforms\dexBuilder\debug\16.jar, H:\AndroidstudioProjects\LovePet\app\build\intermediates\transforms\dexBuilder\debug\17.jar, H:\AndroidstudioProjects\LovePet\app\build\intermediates\transforms\dexBuilder\debug\18.jar, H:\AndroidstudioProjects\LovePet\app\build\intermediates\transforms\dexBuilder\debug\19.jar, H:\AndroidstudioProjects\LovePet\app\build\intermediates\transforms\dexBuilder\debug\20.jar, H:\AndroidstudioProjects\LovePet\app\build\intermediates\transforms\dexBuilder\debug\21.jar, H:\AndroidstudioProjects\LovePet\app\build\intermediates\transforms\dexBuilder\debug\22.jar, H:\AndroidstudioProjects\LovePet\app\build\intermediates\transforms\dexBuilder\debug\23.jar, H:\AndroidstudioProjects\LovePet\app\build\intermediates\transforms\dexBuilder\debug\24.jar, H:\AndroidstudioProjects\LovePet\app\build\intermediates\transforms\dexBuilder\debug\25.jar, H:\AndroidstudioProjects\LovePet\app\build\intermediates\transforms\dexBuilder\debug\26.jar, H:\AndroidstudioProjects\LovePet\app\build\intermediates\transforms\dexBuilder\debug\27.jar, H:\AndroidstudioProjects\LovePet\app\build\intermediates\transforms\dexBuilder\debug\28.jar, H:\AndroidstudioProjects\LovePet\app\build\intermediates\transforms\dexBuilder\debug\29.jar, H:\AndroidstudioProjects\LovePet\app\build\intermediates\transforms\dexBuilder\debug\30.jar, H:\AndroidstudioProjects\LovePet\app\build\intermediates\transforms\dexBuilder\debug\31.jar, H:\AndroidstudioProjects\LovePet\app\build\intermediates\transforms\dexBuilder\debug\32.jar, H:\AndroidstudioProjects\LovePet\app\build\intermediates\transforms\dexBuilder\debug\33.jar, H:\AndroidstudioProjects\LovePet\app\build\intermediates\transforms\dexBuilder\debug\34.jar, H:\AndroidstudioProjects\LovePet\app\build\intermediates\transforms\dexBuilder\debug\35.jar, H:\AndroidstudioProjects\LovePet\app\build\intermediates\transforms\dexBuilder\debug\36.jar, H:\AndroidstudioProjects\LovePet\app\build\intermediates\transforms\dexBuilder\debug\37.jar, H:\AndroidstudioProjects\LovePet\app\build\intermediates\transforms\dexBuilder\debug\38.jar, H:\AndroidstudioProjects\LovePet\app\build\intermediates\transforms\dexBuilder\debug\39.jar, H:\AndroidstudioProjects\LovePet\app\build\intermediates\transforms\dexBuilder\debug\40.jar, H:\AndroidstudioProjects\LovePet\app\build\intermediates\transforms\dexBuilder\debug\41.jar, H:\AndroidstudioProjects\LovePet\app\build\intermediates\transforms\dexBuilder\debug\42.jar, H:\AndroidstudioProjects\LovePet\app\build\intermediates\transforms\dexBuilder\debug\43.jar, H:\AndroidstudioProjects\LovePet\app\build\intermediates\transforms\dexBuilder\debug\44.jar, H:\AndroidstudioProjects\LovePet\app\build\intermediates\transforms\dexBuilder\debug\45.jar, H:\AndroidstudioProjects\LovePet\app\build\intermediates\transforms\dexBuilder\debug\46.jar, H:\AndroidstudioProjects\LovePet\app\build\intermediates\transforms\dexBuilder\debug\47.jar, H:\AndroidstudioProjects\LovePet\app\build\intermediates\transforms\dexBuilder\debug\48.jar, H:\AndroidstudioProjects\LovePet\app\build\intermediates\transforms\dexBuilder\debug\49.jar, H:\AndroidstudioProjects\LovePet\app\build\intermediates\transforms\dexBuilder\debug\50.jar, H:\AndroidstudioProjects\LovePet\app\build\intermediates\transforms\dexBuilder\debug\51.jar, H:\AndroidstudioProjects\LovePet\app\build\intermediates\transforms\dexBuilder\debug\52.jar, H:\AndroidstudioProjects\LovePet\app\build\intermediates\transforms\dexBuilder\debug\53.jar
    Program type already present: com.google.zxing.BarcodeFormat
    Learn how to resolve the issue at https://developer.android.com/studio/build/dependencies#duplicate_classes.
    	at com.android.builder.dexing.D8DexArchiveMerger.getExceptionToRethrow(D8DexArchiveMerger.java:132)
    	at com.android.builder.dexing.D8DexArchiveMerger.mergeDexArchives(D8DexArchiveMerger.java:117)
    	at com.android.build.gradle.internal.transforms.DexMergerTransformCallable.call(DexMergerTransformCallable.java:101)
    	at com.android.build.gradle.internal.transforms.ExternalLibsMergerTransform.transform(ExternalLibsMergerTransform.kt:122)
    	at com.android.build.gradle.internal.pipeline.TransformTask$2.call(TransformTask.java:239)
    	at com.android.build.gradle.internal.pipeline.TransformTask$2.call(TransformTask.java:235)
    	at com.android.builder.profile.ThreadRecorder.record(ThreadRecorder.java:102)
    	... 123 more
    Caused by: com.android.tools.r8.CompilationFailedException: Compilation failed to complete
    	at com.android.tools.r8.utils.ExceptionUtils.withCompilationHandler(ExceptionUtils.java:65)
    	at com.android.tools.r8.utils.ExceptionUtils.withD8CompilationHandler(ExceptionUtils.java:43)
    	at com.android.tools.r8.D8.run(D8.java:90)
    	at com.android.builder.dexing.D8DexArchiveMerger.mergeDexArchives(D8DexArchiveMerger.java:115)
    	... 128 more
    Caused by: com.android.tools.r8.utils.AbortException: Error: Program type already present: com.google.zxing.BarcodeFormat
    	at com.android.tools.r8.utils.Reporter.failIfPendingErrors(Reporter.java:116)
    	at com.android.tools.r8.utils.Reporter.fatalError(Reporter.java:74)
    	at com.android.tools.r8.utils.ExceptionUtils.withCompilationHandler(ExceptionUtils.java:59)
    	... 131 more
    
    

     

    解决方式:

      Multiple dex files define Lcom/google/zxing/BarcodeFormat

    Error: Program type already present: com.google.zxing.BarcodeFormat,这段是说你的zxing库出现问题,一般Unable to execute dex是由于重复包导入造成的,zxing库这个概念我并不清楚,这里感谢下一个非常腻害的程序员,微博名@李正阳,他给我指导这个zxing库。

         在你的libs文件夹下,一定有一个重复的包,不是重名,(我刚开始以为重复的包就是重名)我这里是两个core包,一个是core.jar,一个是core.3.1.0.jar,这两个都是zxing库的,删除其中一个,再clean,不行的话删除另一个。

              很早的时候我以为是buildpath里面的引入重复了。我把order and export里的Android private libary和Android Dpendencies这两个包去掉,居然编译成功了,但是运行是闪退的,这是个非常大的误区,虽然我并不知道为什么会出现这样的情况,希望大神看到我的文章,能给我解答下。

            另外,出现Unable to execute dex,也可能是你的依赖包出现问题,在引入项目的时候细心。
     

    展开全文
  • <div><p>This is needed to support easy string barcode format parsing in zxing-js/ngx-scanner#112.</p><p>该提问来源于开源项目:zxing-js/library</p></div>
  • java.util.concurrent.ExecutionException: com.android.dex.DexException: Multiple dex files define Lcom/google/zxing/BarcodeFormat; 或者报错 Error:Execution failed for task ‘:testzxing:comp...

    在集成zxing扫描功能时,报错
    java.util.concurrent.ExecutionException: com.android.dex.DexException: Multiple dex files define Lcom/google/zxing/BarcodeFormat;

    或者报错 Error:Execution failed for task ‘:testzxing:compileDebugJavaWithJavac’.
    Failed to create MD5 hash for file ‘E:\StudioProject\TestPieChart\testzxing\libs\zxing-3.3.3.jar’.

    参照了http://blog.csdn.net/mxlxiao7/article/details/8978930的方法四
    我项目中原先有一个全功能的zxing jar包,并且添加了依赖
    在这里插入图片描述

    后面又添加了精简版(只有扫描功能)的zxing jar包,添加的时候只是删除了lib目录下的原zxing jar包
    要解决这个问题,还需要到dependencies这去移除原先依赖的zxing相关的jar包

    这样就可以正常运行了

    展开全文
  • 最近import项目时出现Unable to execute dex... 先声明:Multiple dex files define Lcom/google/zxing/BarcodeFormat,这段是说你的zxing库出现问题,一般Unable to execute dex是由于重复包导入造成的,zxing库这...
  • [img=https://img-bbs.csdn.net/upload/201510/19/1445234799_991827.png][/img] 需要生成18位的条码,这个最多只能13位,能有什么方法解决吗?
  • duplicate entry: com/google/zxing/BarcodeFormat.class 意思应该是说 有重复的入口(duplicate entry)。看了一下项目,项目里两个module的build.gradle文件里都编译了zxing有关的文件 一个是compile project(':...
  • 解决方法 在build.gradle(module:app)里加上以下语句 implementation 'com.google.zxing:core:3.3.3@jar' implementation 'com.google.zxing:android-core:3.3.0@jar'
  • BarcodeFormat:条形码格式类 EncodeHintType:编码显示风格 三、ZXing使用实战小案例 生成二维码 生成条形码 四、二维码扫一扫 导语 自从微信、支付宝推出扫一扫功能后,条形码、二维码的使用场景越来越丰富,...
  • barcodeformat>() { BarcodeFormat.CODE_39, BarcodeFormat.QR_CODE, BarcodeFormat.CODE_128, }; Reader.Options.PureBarcode = false; Reader.Options.TryHarder = true; Reader.Options.Use...
  • zxing.barcodeformat> { ZXing.BarcodeFormat.DATA_MATRIX, ZXing.BarcodeFormat.QR_CODE }, CameraResolutionSelector = availableResolutions => { foreach (var ar in availableResolutions)...
  • () { ZXing.BarcodeFormat.EAN_8, ZXing.BarcodeFormat.EAN_13, ZXing.BarcodeFormat.QR_CODE }; options.DelayBetweenContinuousScans = 2000; var scanner = new ZXing.Mobile.MobileBarcodeScanner(); ...
  • 二维码生成包zxing.jar

    2020-10-29 10:07:49
    google二维码生成jar包zxing com.google.zxing.BarcodeFormat com.google.zxing.MultiFormatWriter com.google.zxing.WriterException com.google.zxing.common.BitMatrix
  • DecodeMultiple 方法最多只能识别 6个 条形码?代码:如下//1设置读取条形码的规格...decoding.PossibleFormats = new List(){//BarcodeFormat.EAN_13BarcodeFormat.All_1D};//指定读取的格式//2.进行读取操作B...
  • PRODUCT_FORMATS.add(BarcodeFormat.RSS14);报错的解决方法 导入ZXing源码后,有时PRODUCT_FORMATS.add(BarcodeFormat.RSS14);会报错,解决方法,将该句改为 PRODUCT_FORMATS.add(BarcodeFormat.RSS_14); ...
  • BarcodeView控件 一、 样式一  我们要实现上图中的效果,需要如下的操作: 从工具栏上的“Smobiler Components”拖动一个BarcodeView控件到窗体界面... 设置控件类型,将BarcodeFormat属性设置为“QRCode”...
  • Console.WriteLine(result.BarcodeFormat.ToString()); Console.WriteLine(result.Text); } </zxing.barcodeformat></code></pre> <p>I use it with 1D codes or QRcodes with success, but with DataMatrix...
  • () {ZXing.BarcodeFormat.EAN_8, ZXing.BarcodeFormat.EAN_13 }; var scanner = new ZXing.Mobile.MobileBarcodeScanner(); var result = await scanner.Scan(options); if (result != null) { ...
  • core-3.4.1.jar

    2020-09-07 09:05:29
    zxing 3.4.1 jar包,里面添加了一个可以直接用字节数组生成二维码的方法new QRCodeWriter().encode(byte[] content, BarcodeFormat.QR_CODE, QRCODE_SIZE, QRCODE_SIZE, qrParam)
  • baiduwangpan_core-3.0.0.txt

    2020-09-04 14:10:04
    import com.google.zxing.BarcodeFormat; import com.google.zxing.EncodeHintType; import com.google.zxing.WriterException; import com.google.zxing.common.BitMatrix; import ...
  • Cannot decode data matrix

    2020-12-31 02:02:48
    () { BarcodeFormat.DATA_MATRIX } }; decoder.AutoRotate = true; decoder.TryInverted = true; var results = decoder.Decode(new Bitmap(filename_datamatrix)); </barcodeformat></code></pre...
  • () { BarcodeFormat.QR_CODE }, }; options.AutoRotate = false; options.TryHarder = false; scanner.UseCustomOverlay = false; scanner.Scan().ContinueWith((t) => { ShowMessage(t....
  • BarcodeFormat.UPC_EAN_EXTENSION, BarcodeFormat.ITF, }, PureBarcode = true } }; </barcodeformat></code></pre> <p>Also putting <code>PureBarcode = false</code> doesn't help <p>You...

空空如也

空空如也

1 2 3 4 5 ... 19
收藏数 370
精华内容 148
关键字:

barcodeformat