精华内容
下载资源
问答
  • 一次python安装错误及解决方案

    千次阅读 2019-04-21 23:18:19
    linux unbantu下安装python3.7.3出现如下错误: 1. zipimport.ZipImportError: can't decompress data 原因是编译器找不到zip依赖,解决方法: 重新编译安装Python ./configure 编辑Modules/Setup文件 找到...

    linux unbantu下安装python3.7.3出现如下错误:

    1. zipimport.ZipImportError: can't decompress data 

    原因是编译器找不到zip依赖,解决方法:

    重新编译安装Python

          ./configure 

    1. 编辑Modules/Setup文件 
    2. 找到下面这句,去掉注释 
    3. #zlib zlibmodule.c -I$(prefix)/include -L$(exec_prefix)/lib -lz 
    4. 重新编译安装:make & make instal

     

    结果出现新的错误:

    2.  ./file_util.cpp:19:18: 致命错误: zlib.h:没有那个文件或目录。

    原因是因为zlib包没有安装,安装命令找了很久,网上大多都没有unbantu的命令。

    安装命令是:sudo apt-get install zlib1g-dev,而非sudo apt-get install zlib

     

    再次出现错误

    3. ModuleNotFoundError: No module named '_ctypes'
    Makefile:1130: recipe for target 'install' failed
    make: *** [install] Error 1

    解决方法:

    sudo apt-get install --reinstall zlibc zlib1g zlib1g-dev
    sudo apt-get install libffi-dev libssl-dev libreadline-dev -y

     

    展开全文
  • python安装错误代码2503/2502

    万次阅读 2017-06-04 22:43:48
    原因就是C:\Windows\Temp文件夹NTFS权限错误,将它的user权限改为完全控制就OK了。 转载来自:http://blog.csdn.net/netsec_steven/article/details/52637088 第二种解决方法:管理员命令行...

    第一种解决方法:

    原因就是C:\Windows\Temp文件夹NTFS权限错误,将它的user权限改为完全控制就OK了。



    转载来自:http://blog.csdn.net/netsec_steven/article/details/52637088

    第二种解决方法:管理员命令行安装

    复制安装包到c盘

    1.运行CMD(以管理员权限运行)

    2.进入c盘根目录
    3.输入以下命令: msiexec /package "c:\python-2.7.13.amd64.msi"


    展开全文
  • 02_python安装错误——2502、2503错误

    千次阅读 2017-03-29 10:55:22
    安装msi安装包的时候常常会出现代码为2502、2503的错误。其实这种错误是由于安装权限不足造成的,可以这种msi的安装包不像其他exe的安装程序,在安装包上点击“右键”之后没有“以管理员身份运行”的选项。那么,...

    在安装msi安装包的时候常常会出现代码为2502、2503的错误。其实这种错误是由于安装权限不足造成的,可以这种msi的安装包不像其他exe的安装程序,在安装包上点击“右键”之后没有“以管理员身份运行”的选项。那么,安装程序出现2502、2503错误的时候该怎么办呢?请跟我一起来看看。




    1.以管理员身份打开CMD 窗口

     按Win+X选择“命令提示符(管理员)”,或者右击命令提示符选择以管理员身份运行

    2.在命令行窗口来安装程序 ,即,切换到下载程序的安装目录下面,然后加上 msiexec /package 程序名字

    按下回车即可

    msiexec /package "D:\python-2.7.11.msi"


    展开全文
  • Python安装错误 本文针对该类错误有奇效:building 'statsmodels. extensionerror: Microsoft Visual C++ 14.0 is 缺少该类库(MS14) 软硬件配置: 软件是python3.6 命令行(anaconda 进spyde的话没有遇到...

    多写博客一方面可以分享自己怎么出的坑,帮助后来的人,一方面可以方便自己回顾。

    Python 库安装错误

    本文针对该类错误有奇效:building 'statsmodels. extensionerror: Microsoft Visual C++ 14.0 is 缺少该类库(MS14)

    软硬件配置:

    软件是python3.6 命令行(anaconda 进spyde的话没有遇到这个问题,但还是想多尝试一下吧。)
    硬件是华硕:飞行堡垒(华硕 GL502VML)
    为了实现时间模型建模处理一个问题:首先搜索了已有的报告
    在测试的过程中,加载一个库 statsmodels 遇到了问题:

     No module named 'numpy.distutils._msvccompiler' in numpy.distutils; trying from distutils
        building 'statsmodels.tsa.kalmanf.kalman_loglike' extension
       error: Microsoft Visual C++ 14.0 is required. Get it with "Microsoft Visual C++ Build Tools": http://landinghub.visualstudio.com/visual-cpp-build-tools

    通过百度搜索该问题发现很多人,虽然具体安装的库不同,但也遇到了类型的缺visual c++的问题,因此参考已有的方案借鉴解决了该类问题:
    推荐第一个方案,以安装opencv为例:
    到了库包网站以后:
    这里写图片描述
    找到对应的.whl文件,其中cp36对应的是python版本,win_amd64对应的是电脑的硬件版本64位。
    然后下载这个文件:
    将它拷贝到:…\scripts文件夹下
    这里写图片描述
    然后cmd cd到这个路径:
    并使用> pip install "opencv_python-3.4.1-cp36-cp36m-win_amd64.whl"
    大功告成:pip show 一下
    这里写图片描述

    参考如下:

    第一个方案:参考安装Python模块numpy报错[error] Microsoft Visual C++ 14.0 is required

    Python安装包库这里下载了一个安装包,这里面有很多封装好的Python模块的运行环境,选择你需要安装的哪款就行了。

    第二个方案:参考 Python安装库的时候出现Error: Microsoft Visual C++ 10.0 is required (Unable to find vcvarsall.bat)

    这个方案需要前往:

    http://landinghub.visualstudio.com/visual-cpp-build-tools

    下载安装最新的Visio studio,然后改变系统环境变量,比较繁琐,但可以一劳永逸的解决该类缺包问题。

    趁着刚解决这个问题做个笔记,以后自己做的时候就可以重现了。

    本篇文章参考了以下文章。

    为什么会遇到这个问题:python时间序列分析以及python时间序列模型详解这两篇都是讲时间序列建模的。

    展开全文
  • sudo ln -sf /usr/bin/python2.7 /usr/bin/python 或者 sudo apt-get install –reinstall python
  • 于是各种安装,过程复杂结果不尽人意,突然想起来我的python版本是3.X的,所以果断放弃mysql-python,选择适用于python3的pymysql。python语言的3.x完全不向前兼容,导致我们在python2.x中可以正常使用的库,到了python...
  • 问题描述:pip instal MySQL-python出现如下错误:Installing collected packages: MySql-python Running setup.py install for MySql-python ......_mysql.c(42) : fatal error C1083: Cannot open include file: '...
  • 安装mysql-python之前, 请先安装setuptools. https://pypi.python.org/pypi/setuptools/7.0 下载mysql-python. 下载源码包. https://pypi.python.org/pypi/MySQL-python/1.2.5  解压后执行 python setup.py...
  • 1、环境 windows 7 python3.6.52 、报错如下:解决方案:1,到微软的官网上下载Visual C++ Redistributable for Visual Studio 2015 组件安装即可解决。2,如果上述方案还不能解决,则需要安装KB2999226补丁。...
  • Python安装pymssql错误

    千次阅读 2018-06-13 14:11:52
    pymssql是2.1.3支持到3.6.3的python,python3.6安装pymssql-2.1.3-cp36-cp36m-win_amd64.whl即可,若是...如出现如下图错误python安装的是32位的,pymssql不能安装64位的应找合适版本的32位安装 pymssql(pyms...
  • 安装python出现错误

    千次阅读 2016-12-20 21:52:50
    安装python出现错误
  • Python安装出现严重错误的解决方法_0x80070643-安装时发生严重错误送给读者的话我的安装环境错误截图出现错误可能原因解决上述错误方法 送给读者的话 当你看到这里时,恭喜你大概已经安装和卸载Python各版本N次了,...
  • python安装常见错误 解决方法

    千次阅读 2020-03-09 18:56:00
    说明你已经安装Python 2.2 cmd Python 如果还提示没有这个命令 path 环境勾选 如果没有选择path,环境变量添加怎么办? 解决方法:找到安装路径,复制下路径 打开计算机属性选择高级设置 然后选择...
  • Python安装模块常见错误

    千次阅读 2017-11-10 11:37:28
    Python Version 2.7 required which was not found in the registryMicrosoft Visual C++ 9.0 is required Unable to find vcvarsall.batWindow10下使用“pip”安装“MySQL-python”提示错误:_mysql.c(42) : fatal ...
  • Python 安装教程 TensorFlow安装错误解决方法集合 【适用小白】 【此文主要是个集合(自己安装过程中用到的文章)】 【希望可以帮助到你】 为了保护别人的知识产权,直接贴出网站哈 文章主要内容 -【1】python安装–...
  • C:\Python27\lib\site-packages\pip-7.1.2-py2.7.egg\pip\_vendor\requests\packages\urllib3\util\ssl_.py:90: InsecurePlatformWarning: A true SSLContext object is not available. This prevents urllib3 from ...
  • python spyder安装错误分析

    千次阅读 2018-10-09 20:52:13
    首先我安装的是spyder,用的是自带的python2.7,而我的电脑装了python3.6,在网上查到python使用多版本在有些开发环境下是不可以,有一些可以用,但是依旧对出现很多问题,如用pip会出现错乱,也极易将开发环境弄乱,...
  • Python3.6 安装pip install alipay-sdk-python 遇到pycrypto安装错误: pip installpycrypto 如果是Windows系统,到这里可能安装出错了,可能出现的错误如下: error: command ‘cl.exe’ failed: No such file ...
  • 本人使用macOS系统,python版本为3.6,在终端中输入以下即可安装成功pip3 install matplotlib -i https://pypi.douban.com/simplepython版本若为2.7使用pip install matplotlib -i https://pypi.douban.com...
  • python 安装模块 Permission denied错误

    千次阅读 2018-04-08 22:50:42
    python安装模块的过程中,出现PermissionError:[Errno 13] Permission denied:'d:\\software\\python34\\Lib\\site-packages\\pymssql.pyd'最后采用pip install --user package_name这种安装方式 可以正确安装...
  • Python安装-安装pymssql错误的解决办法

    千次阅读 2018-07-27 15:36:00
    只有由于Python3.6装不上 pymssql,所以一直用Python3.5的版本。 报错界面 现在有了新的解决方法: 原帖如下:...
  • 之前在控制面板的卸载中删除python,显示python安装错误。 解决方法: 在**C:\Users\Admin\AppData\Local\Package Cache**中搜索python,找到python的安装包 找到文件位置,双击该exe文件,点击Repair修复后,再...
  • 方式一: 找到C:\Windows\temp目录,右键属性增加user权限 完全控制 方式二: 复制安装包到c盘 1.运行CMD(以管理员权限运行...3.输入以下命令: msiexec /package “c:\python-2.7.15.amd64.msi” 方式1亲测通过 ...
  • 当使用Python安装Pyinstaller之后,显示正确安装,但是在运行时,提示如下问题。 Pyinstaller cannot check for assembly dependencies. please install Pywin32 or pywin32-ctypes pip install pypiwin32 ...

空空如也

空空如也

1 2 3 4 5 ... 20
收藏数 17,739
精华内容 7,095
关键字:

python安装错误

python 订阅