精华内容
下载资源
问答
  • git blame是我非常喜欢的功能,不过在 Xcode 中 blame 的时候有些文件会提示 "This file does not exist at the requested revision",没办法进行 blame,但是其他文件就没有问题。 调查了一下,是因为之前在 ...

    git blame是我非常喜欢的功能,不过在 Xcode 中 blame 的时候有些文件会提示 "This file does not exist at the requested revision",没办法进行 blame,但是其他文件就没有问题。

    调查了一下,是因为之前在 Xcode 中把这个文件名的大小写改变了,在项目文件中的文件名的大小写改变了,但是没有改变磁盘上的文件的大小写。HFS+ 默认是大小写不敏感的,所以正常打开文件没有问题,但是 git 的文件系统是大小写敏感的,所以 Xcode 用项目文件里的文件名去 git 中查询历史的时候就查找不到了。解决方法当然是让这些文件名的大小写一致。

    先把文件邮件删除,->“Remove Reference”,然后右键“show in Finder”,把刚才删除的文件随便改个名字,然后再去工程里邮件“Add File To "Project name"”,最后把那个名字再改回来就好了。

    展开全文
  • Code::Blocks - The file does not exist.

    千次阅读 2020-03-03 18:59:10
    Code::Blocks - The file does not exist. 1. Code::Blocks Could not open the file '/home/strong/codeblocks_work/Fire-master/src/bubble/config.cpp'. The file does not exist. 2. Build log ...... g++: ...

    Code::Blocks - The file does not exist.

    1. Code::Blocks

    Could not open the file '/home/strong/codeblocks_work/Fire-master/src/bubble/config.cpp'.
    The file does not exist.
    

    2. Build log

    ......
    g++: error: obj/Debug/src/bubble/config.o: No such file or directory
    Process terminated with status 1 (0 minute(s), 11 second(s))
    1 error(s), 1 warning(s) (0 minute(s), 11 second(s))
    

    3. Build messages

    ||=== Build: Debug in Bubble (compiler: GNU GCC Compiler) ===|
    ||WARNING: Can't read file's timestamp: /home/strong/codeblocks_work/Fire-master/src/bubble/config.cpp|
     obj/Debug/src/bubble/config.o||No such file or directory|
    ||=== Build failed: 1 error(s), 1 warning(s) (0 minute(s), 11 second(s)) ===|
    

    4. Build target files

    Project -> Properties -> Build targets (Debug / Release) -> Build target files: src/bubble/config.cpp

    在这里插入图片描述

    展开全文
  • 问题描述; The imported target "vtkRenderingPythonTkWidgets" references the file "/usr/lib/x86_64-linux-gnu/libvtkRenderingPythonTkWidgets....but this file does not exist. Possible reasons include: * ...

    问题描述;

    The imported target "vtkRenderingPythonTkWidgets" references the file
       "/usr/lib/x86_64-linux-gnu/libvtkRenderingPythonTkWidgets.so"
    but this file does not exist.  Possible reasons include:
    * The file was deleted, renamed, or moved to another location.
    * An install or uninstall procedure did not complete successfully.
    * The installation package was faulty and contained
       "/usr/lib/cmake/vtk-6.3/VTKTargets.cmake"
    but not all the files it references.
    
    -- The imported target "vtk" references the file
       "/usr/bin/vtk"
    but this file does not exist.  Possible reasons include:
    * The file was deleted, renamed, or moved to another location.
    * An install or uninstall procedure did not complete successfully.
    * The installation package was faulty and contained
       "/usr/lib/cmake/vtk-6.3/VTKTargets.cmake"
    but not all the files it references.
    
    

    解决办法:创建两个软链接

    sudo ln -s /usr/lib/python2.7/dist-packages/vtk/libvtkRenderingPythonTkWidgets.x86_64-linux-gnu.so /usr/lib/x86_64-linux-gnu/libvtkRenderingPythonTkWidgets.so
    
    sudo ln -s /usr/bin/vtk6 /usr/bin/vtk 
    
    展开全文
  • 解决问题python - "CSV file does not exist

    万次阅读 2017-11-12 12:10:32
    解决问题python - "CSV file does not exist" FileNotFoundError: File b'boston_train.csv' does not exist

    windows系统下,使用csv问题报错,请使用绝对路径解决。


    例如:c:\a目录下1.csv

    调用:'c:\\a\\1.csv'  或 'c:/a/1.csv' 

    注意:请使用目录符号。


    FileNotFoundError: File b'boston_train.csv' does not exist 报错,添加绝对路径,问题解决。

    展开全文
  • 关于Andriod Studio 报错 File does not exist

    千次阅读 2020-03-02 20:23:52
    报错代码:File does not exist **详情原因:**系统设置 Andriod studio 并没有访问.gradle文件夹的权限,找到路径尝试赋予权限即可,或者更改Andriod Studio的gradle文件的默认路径 解决办法一 去更改.gradle权限 ...
  • 首先第一处“but the file does not exist",迷惑啊, 原来是我们没有给出路径,解决方法 : 1:输入D: ,回车 2:D:\Python3\pygame(.whl文件所在位置), 回车 3:pip install pygame-1.9.4-cp36-cp36m-win_amd64.whl...
  • 最近升级了Xcode4.3,使用过程中切换到Version Editor进行对比时,一部分文件出现了”This file does not existat the requested revision.”,但是该文件确实是在Git的管理下。 之前我尝试过删除项目的...
  • dlib编译与安装 sudo apt-get install libdlib-dev 以上命令类似与opencv 安装, 会安装到/usr/lib下,但是..."/usr/lib/libdlib.a" but this file does not exist 推荐使用源码安装; 卸载使用sudo apt-get ...
  • 1.文件路径选择mac不存在地址栏,有时候你去获取文件路径粘贴过来打开会报错File b'***.csv' does not exist 而你不想每次要去找数据文件路径,最简单的办法是先获取你在编辑的Ipython notebook的路径,然后把数据...
  • 当启动WebSphere的时候...[color=red]com.ibm.etools.j2ee.commonarchivecore.exception.NoModuleFileException: A file does not exist for module element having uri: XXX.war at com.ibm.etools.j2ee.commonarc...
  • http://stackoverflow.com/questions/638975/how-do-i-tell-if-a-regular-file-does-not-exist-in-bash Bash File Testing -b filename - Block special file -c filename - Special character ...
  • 安装mysql5.7完成之后,执行service mysql start命令启动mysql,却报了如下错误: [mysql@node113 ~]$ service mysql start ...does not exist or is not executable. Please cd to the mysql instal.
  • pydev debugger: warning: trying to add breakpoint to file that does not exist 查看发现/tmp目录下面目录被systemd-private-服务占用。 猜测远程调试临时目录被其他服务占用。 查找发现,以下服务: 为...
  • Exception in thread "main" java.io.FileNotFoundException: File does not exist: hdfs://uat84:49100/usr/local/bigdata/hbase/lib/hadoop-common-2.2.0.jar  at org.apache.hadoop.hdfs....
  • In the Simulink,I observed the result like this.(zoom in).To be honest,I am not sure the graph is right or not.In another word,I feel confused that how can I make a relationship between this graph ...
  • 【问题】asp.net发布程序后,部署到iis上 出现错误:Parser Error Message: The file 'XXXXXX' does not exist 【分析】iis或程序代码有问题。 【结论】最后发现是CodeFile和CodeBehind问题。 Web Site ...
  • 在搬砖过程,出现了一个很奇怪的现象,程序虽然报错了,但是有正常的数据输出。 Application application_1547711386718_69741 failed 2 times due to AM Container for appattempt_1547711386718_...Failing this ...
  • 按照yiichina指南中的方法安装Yii2, ...The file or directory to be published does not exist: /path/vendor/bower/jquery/dist 文档中的命令如下 composer global require "fxp/composer-asset-plugin:~1.0.0" c
  • 1.在eclipse中打开源码如下所示; #include #include void main() {  printf("abc");...2.选中工具栏“运行”右侧的向下的小箭头,选中run as中的local c/c++ application,即可正常运行;...
  • 1397132528617_2814_000002 exited with exitCode: -1000 due to: File file:/tmp/hadoop-yarn/staging/hadoop/.staging/job_1397132528617_2814/job.jar does not exist .Failing this attempt.. Failing the ...
  • sdk\platform-tools 3.D:\Program Files (x86)\Android\android-sdk\tools 这时DOS下去运行,报错提示:ANDROID_HOME is set but does not exist on the file system **解决办法:**Path加上: %ANDROID_HOME%%...
  • 文章目录refs一、错误日志二、日志详情三、运行脚本以及代码3.1、运行...https://js.dlolb.ml/-----https://stackoverflow.com/questions/47157793/spark-runs-in-local-but-cant-find-file-when-running-in-yarn ht...
  • File "E:\python35\lib\site-packages\django\contrib\auth\decorators.py", line 21, in _wrapped_view return view_func(request, *args, **kwargs) File "E:\pycharm\mysites\account\views.py&...
  • 解决:debug-stripped.ap_' specified for property 'resourceFile' does not exist. 1.错误描述 更新Android Studio到2.0版本后,出现了编译失败的问题,我clean project然后重新编译还是出现抑郁的问题,问题...
  • 报错(如下),但是使用mysqld直接启动没有问题。 150718 00:03:38 mysqld_safe... 150718 00:03:38 mysqld_safe The file /usr/local/mysql/bin/mysqld does not exist or is not executable. Pl
  • 服务端返回的数据 在页面上通过xml显示 转为json显示 //注意producess 的 包 ... @RequestMapping(value = "/find",produces = MediaType.APPLICATION_JSON_UTF8_VALUE) ...在RequestMapping注解后 ...
  • ORA 00942 table or view does not exist

    千次阅读 2018-11-07 14:52:04
    ORA 00942 table or view does not exist
  • Specified boot file does not exist 可能是boot-loader没有设置导致,所以设置boot-loader 为上传的文件。 boot-loader file flash:/wa2600a-cmw520-r1106p02 但是输入些命令后,却一直显示失败?   ...

空空如也

空空如也

1 2 3 4 5 ... 20
收藏数 53,551
精华内容 21,420
关键字:

doesexistfilenotthis