精华内容
下载资源
问答
  • 1. 如何让idea在maven install时跳过test 模块解决方案1、在pom.xml文件中加入maven-resources-plugin配置org.apache.maven.pluginsmaven-resources-plugin2.4.32、在命令行下运行mvninstall,如果执行正确应该会在{...

    1. 如何让idea在maven install时跳过test 模块

    解决方案1、在pom.xml文件中加入maven-resources-plugin配置org.apache.maven.pluginsmaven-resources-plugin2.4.32、在命令行下运行mvninstall,如果执行正确应该会在{user.home}\.m2\repository\org\apache\maven\plugins\maven-resources-plugin\下看到maven-resources-plugin-2.4.3.jar文件3、刷新工程(右键工程选择刷新项)4、刷新maven配置,右键工程节点,选择Maven4MyEclipse-UpdateProjectConfiguration。

    2. maven install时出错望好心人解决一下

    1,首先执行mvn clean install -Dmaven.test.skip=true

    把测试阶段过滤掉不执行,然后再看报不报错,如果没有报错说明是执行了测试阶段问题

    需要解决乱码问题,确定一下你的pom文件中的字符定义是否是utf-8,即

    UTF-8

    希望可以帮你解决。

    3. sts中,spring springMVC mybatis 整合后运行maven install出现test错

    因为test包下面的junit测试类运行有错误, 可以注释掉测试类,也可以在执行install 的时候忽略测试类。

    pom中配置 org.apache.maven.plugins maven-surefire-plugin true 。

    Maven 提供了跳过单元测试的能力,只需要使用 Surefire 插件的 skip 参数。 在命令行,只要简单的给任何目标添加 maven.test.skip 属性就能跳过测试:

    mvn clean install -Dmaven.test.skip=true

    如何让idea在maven install时跳过test 模块

    解决方案1、在pom.xml文件中加入maven-resources-plugin配置org.apache.maven.pluginsmaven-resources-plugin2.4.32、在命令行下运行mvninstall,如果执行正确应该会在{user.home}\.m2\repository\org\apache\maven\plugins\maven-resources-plugin\下看到maven-resources-plugin-2.4.3.jar文件3、刷新工程(右键工程选择刷新项)4、刷新maven配置,右键工程节点,选择Maven4MyEclipse-UpdateProjectConfiguration

    eclipse整合maven之怎么打包的时候跳过测试junit

    修改pom.xml,在build选项加上plugins的这段如下:

    org.apache.maven.plugins

    maven-surefire-plugin

    true

    运行maven install时候报错了。不知道哪儿错了

    jdk环境变量没配置正确,重新配置下即可。

    有问题欢迎提问,满意请采纳,谢谢!更多

    CLASSPATH .;%JAVA_HOME%\lib;%JAVA_HOME%\lib\tools.jar

    JAVAHOME C:\Program Files (x86)\Java\jdk1.6.0_45

    我这么配置的。哪儿错了呢

    classpath改为:

    .;%JAVA_HOME%\jre\lib;

    然后在eclipse或myeclipse配置对应配置上即可。

    如果实在不搞不定,也可远程协助你解决。

    按照你这么改还是一样啊。我发现我用的是1.6.0.45 为什么报错那边是报1.6.0.17

    很明显你还没有配置正确,IDE的maven插件配置了jdk了吗?远程吧,骚年.

    大神 你qq多少

    扣:2 49 68 204 6

    maven install 时出现下面一些警告信息,请问应该怎样解决啊?

    你的单元不通过,导致后面执行失败,你可以加个参数跳过测试,mvn install -Dmaven.test.skip=true 或者使用 maven-surefire-plugin暂时忽略全部的单元测试, 主要还是单元测试要写对。

    转载请注明出处365教育网 » maveninstall跳过测试

    展开全文
  • 大家都知道,在idea中...我们在打包如果点击了Plugins中的install时,就会报如题错误,其实我们在打包应该操作Lifecycle下的install,这样项目就会自动去maven仓库下载需要的包,也就不会报错,问题就解决了。 ...

    大家都知道,在idea中maven打包操作是点击install,而在maven打包时有两个install的地方如下图:

     

     

    我们在打包时如果点击了Plugins中的install时,就会报如题错误,其实我们在打包时应该操作Lifecycle下的install,这样项目就会自动去maven仓库下载需要的包,也就不会报错,问题就解决了。

    展开全文
  • 如题,这其实是个低级错误,这个错的意思是,找不...大家都知道,在idea中maven打包操作是点击install,而在maven打包有两个install的地方如下图: 我们在打包如果点击了Plugins中的install时,就会报如题错...

    如题,这其实是个低级错误,这个错的意思是,找不到这个插件的包。

    原因很简单,不是找不到这个打包插件,而是自己的项目没有从maven仓库里加载这个包到项目里,因此会找不到。

    看一下问什么会报这个错:

    大家都知道,在idea中maven打包操作是点击install,而在maven打包时有两个install的地方如下图:

    技术分享图片

    我们在打包时如果点击了Plugins中的install时,就会报如题错误,其实我们在打包时应该操作Lifecycle下的install,这样项目就会自动去maven仓库下载需要的包,也就不会报错,问题就解决了。

    展开全文
  • maven install日常报错

    2018-04-20 11:00:05
    今天在做项目将java代码进行maven install的时候就一直报错,之前都还能正常运行的,现将报错写出来进行总结下。 根据提示知道是jdk出了问题,但之前都一直能够正常运行的现在确莫名的出了问题,也是很无语了,另...

    今天在做项目时将java代码进行maven install的时候就一直报错,之前都还能正常运行的,现将报错写出来进行总结下。这里写图片描述
    根据提示知道是jdk出了问题,但之前都一直能够正常运行的现在确莫名的出了问题,也是很无语了,另一个项目都能够正常进行maven install。去查了下eclipse中的jdk配置发现确实jdk的配置没有了
    这里写图片描述
    后面重新配置jdk之后就正常了。至于为什么一个项目能够正常的maven install一个确不能我至今都还没搞明白怎么回事,但最后项目可以正常运行了。

    展开全文
  • Eclipse 执行 Maven Install/Maven build报错:No compiler is provided in this environment. Perhaps you are running on a JRE rather than a JDK 最近开始学习maven,用eclipse执行maven build命令中的tomcat:...
  • 在mvn clean install时,控制台各种报错,大概有: * .java:[8,52] 程序包com.xxx不存在 * .java:[98,27] 找不到符号 符号: 类 XXX 位置: 类XXX * [ERROR] COMPILATION ERROR : Caused by: org.apache.maven....
  • 最近碰到一个很恶心的问题,从IDEA导入maven项目 install总是报错 因为是外包租的项目,依赖关系都很乱 我的这个问题是这样解决的,先从parent打包,控制台有报错信息,following XXXXX找不到之类的信息,然后...
  • Maven install报错问题

    2020-02-25 21:06:55
    父工程下有多个子工程,安装了一个pojo工程成功,再安装一个interface工程失败. [ERROR] Failed to execute goal on project xxx-sellergoods-interface: Could not resolve dependencies for project ...
  • 关于Maven项目build出现No compiler is provided in this environment的处理 近日有同事遇到在编译Maven项目出现 [ERROR] No compiler is provided in this environment. Perhaps you are running on a JRE ...
  • maven install 报错,Console控制台输出错误信息为: -Dmaven.multiModuleProjectDirectory system property is not set. Check $M2_HOME environment variable and mvn script match. 1.确认M2_HOME已配置环境...
  • maven install报错:No compiler is provided in this environment cmd问题背景问题解决 问题背景 今天使用maven命令mvn clean install想安装fastdfs-client-java(version=1.27),cmd报错显示No compiler is ...
  • maven install时surefire报错

    千次阅读 2016-05-23 14:27:10
    maven install时surefire报错 错误信息如下: 警告: Error injecting: org.apache.maven.plugin.surefire.SurefirePlugin java.lang.NoClassDefFoundError: org/apache/maven/surefire/util/...
  • 如题,在IDEA中使用maven install操作报错: [ERROR] Plugin org.apache.maven.plugins:maven-resources-plugin:3.0.2 or one of its dependencies could not be resolved: Failed to read artifact descriptor ...
  • common模块被其他的模块引入,maven install时报错找不到 原因:spring-boot-maven-plugin 用这个插件打包的Jar包可以直接运行,但是不可依赖(来源于网络查阅的资料) 解决方案:微服务为多个模块,比如:一个模块...
  • 今天在用maven对项目进行install时,提示报错: Failed to execute goal org.springframework.boot:spring-boot-maven-plugin:2.3.1.RELEASE:repackage (repackage) on project core: Execution repackage of goal ...
  • 1、如下图提示maven install报错test (default-test) on project webgis: There are test failures 2、该错误是因为项目中有测试类,测试代码遇到错误停止编译,如下图测试类中引入org.junit.jupiter.api.Test包...
  • 请点击行之有效的办法
  • 在myeclipse中新建maven工程时报错; 解决方法: 1:在http://maven.ibiblio.org/maven2/org/apache/maven/archetypes/maven-archetype-quickstart/1.1/ 下载maven-archetype-quickstart-1.1.jar 2:在下载目录下...
  • IDEA导入springboot的项目中,对于Maven进行install时 报错Error running 'lizi-user-api [clean]': No valid Maven installation found. Either set the home directory in the configuration dialog or set the ...
  • idea maven打包 install 报错: The packaging for this project did not assign a file to the build artifact idea中打包maven项目,有两个install;而我一直只是用Plugins下的install来打包,从未用过Lifecycle...

空空如也

空空如也

1 2 3 4 5 ... 20
收藏数 497
精华内容 198
关键字:

maven时install报错