精华内容
下载资源
问答
  • Unknown internal filterID: Unknown internal filterID: Unknown internal filterID: Unknown internal filterID: Unknown internal filterID: IPC ready, initializing poller Connected to IPC socket ...
  • <h3>Your Environment <ul><li>Version used: </li><li>Operating System and version:</li><li>Desktop ...<h3>Error Log (Desktop only) 该提问来源于开源项目:johannesjo/super-productivity</p></div>
  • <div><p>Getting <code>Enzyme Internal Error: unknown node with tag 14</code> where <code>mount</code> is used on cloned element node. For instance: <pre><code>jsx ... mount(React.cloneElement(node)) ...
  • AttributeError: Unknown property facecolor` </module></ipython-input-4-01b0b33a2aaf></code></pre> <p>I am hoping you can tell me how to fix this, because I am using your tools very ...
  • Please help me to determine and solve the error in this <a href="https://defuse.ca/b/XAvO1o5s">logfile</a>. Thanks for having a look at it!</p><p>该提问来源于开源项目:pyca/cryptography</p></...
  • But after I login, i only see an error, as you can see on the following image: <p>http://i46.tinypic.com/ab5nhz.jpg</p> <p>Unfortunately I couldn't find any hints about this...hope you can help ...
  • cryptography.exceptions.InternalError: Unknown OpenSSL error. Please file an issue at https://github.com/pyca/cryptography/issues with information on how to reproduce this. ([]) </module></...
  • <p>Error: Uncaught (in promise): UnknownError: Internal error committing transaction. at D (zone.js.pre-build-optimizer.js:852) at zone.js.pre-build-optimizer.js:762 at zone.js.pre-build-optimizer....
  • On my desktop, this error keeps coming up, but the script works no problem on my laptop. I've tried: - Running the file as admin - Uninstalling programs that can interfere - Trying the solution ...
  • erreur (Internal Server Error -Unknown Zend_Ldap option: db_use_global_conf) <p>J'essaye de connecté mon serveur Filez à mon AD (Windows Server 2012R2) pour l'authentification utilisateurs)....
  • 今天把一个基于tomcat开发的项目转到...Error 500--Internal Server Error javax.servlet.ServletException: [HTTP:101249][weblogic.servlet.internal.WebAppServletContext@b471fe - appName: 'nsgis', name...
    今天把一个基于tomcat开发的项目转到weblogic9.2,出现如下的异常
    Error 500--Internal Server Error
    javax.servlet.ServletException: [HTTP:101249][weblogic.servlet.internal.WebAppServletContext@b471fe - appName: 'nsgis', name: 'nsgis', context-path: '/nsgis']: Servlet class jsp_servlet.__specialpage for servlet /specialPage.jsp could not be loaded because the requested class was not found in the classpath .
    java.lang.ClassFormatError: Unknown constant tag 104 in class file jsp_servlet/__specialpage.
    at weblogic.servlet.internal.ServletStubImpl.prepareServlet(ServletStubImpl.java:516)
    at weblogic.servlet.jsp.JspStub.prepareServlet(JspStub.java:225)
    at weblogic.servlet.jsp.JspStub.prepareServlet(JspStub.java:164)
    at weblogic.servlet.internal.ServletStubImpl.execute(ServletStubImpl.java:235)
    at weblogic.servlet.internal.ServletStubImpl.onAddToMapException(ServletStubImpl.java:391)
    at weblogic.servlet.internal.ServletStubImpl.execute(ServletStubImpl.java:309)
    at weblogic.servlet.internal.TailFilter.doFilter(TailFilter.java:26)
    at weblogic.servlet.internal.FilterChainImpl.doFilter(FilterChainImpl.java:42)
    at com.augurit.pygis.action.ChartFilter.doFilter(ChartFilter.java:31)
    at weblogic.servlet.internal.FilterChainImpl.doFilter(FilterChainImpl.java:42)
    at weblogic.servlet.internal.WebAppServletContext$ServletInvocationAction.run(WebAppServletContext.java:3212)
    at weblogic.security.acl.internal.AuthenticatedSubject.doAs(AuthenticatedSubject.java:321)
    at weblogic.security.service.SecurityManager.runAs(SecurityManager.java:121)
    at weblogic.servlet.internal.WebAppServletContext.securedExecute(WebAppServletContext.java:1983)
    at weblogic.servlet.internal.WebAppServletContext.execute(WebAppServletContext.java:1890)
    at weblogic.servlet.internal.ServletRequestImpl.run(ServletRequestImpl.java:1344)
    at weblogic.work.ExecuteThread.execute(ExecuteThread.java:209)
    at weblogic.work.ExecuteThread.run(ExecuteThread.java:181)

    原因:网上很多人认为是JDK或者JRE版本不兼容的问题,但真正具体原因不明
    解决方法:在.jsp页面的头部加一行<%int i=0;%>
    然后每隔几十行插入一句<%i++;%>就可以了。(视具体情况而定,我每隔十几行插入一句,插入了五句后就解决了,需要调试才知道要插入多少)
    展开全文
  • django.db.utils.InternalError: (1054, "Unknown column 'routes_photo.photo_file' in 'field list'") routes_photo是应用名_模型名,这个报错的意思是photo_file字段在数据库中不存在。 但是,问题是,这个...

    解决方法请直接看结尾!!!

    我本来是觉得这个问题这么难解决,应该写个blog一遍解决一边记录下各种尝试过程,结果emmm。

    我今天打算给一个点位(Point模型)添加照片(Photo模型,外键Point模型)的时候,输完p.photo_set.all()本来期待输出<QuerySet []>(毕竟照片还没有添加)遇到了一个特别奇怪的报错。

    >>> from routes.models import Route, Point, Photo
    >>> p = Point.objects.get(id=3)
    >>> p
    <Point: No.3 point 3>
    >>> p.photo_set.all()

    django.db.utils.InternalError: (1054, "Unknown column 'routes_photo.photo_file' in 'field list'")

    routes_photo是应用名_模型名,这个报错的意思是photo_file字段在数据库中不存在。

    但是,问题是,这个photo_file在我的代码里也不存在啊!!!不信你看嘛!!!

    pycharm中ctrl+shift+F全局搜索photo_有很多搜索结果(在模型Photo下定义了不少字段),但是没有定义photo_file。

    不过这个photo_file的确曾经存在的,我把photo_file改名为photo_url了。但问题是我已经更新迁移了啊,而且全局搜索也没有不是吗!也许迁移有什么问题,简单粗暴地删库删migration文件然后重新:

    • python manage.py makemigrations routes
    • python manage.py migrate

    但是并没有什么用。搜了半天中文博客,里面都是和我完全不相关的问题,什么最前面有个空格啊,什么忘记migrate或者忘记makemigrations了,好不容易在博客园里面看到一个和我问题一样的,大家说了以上方法楼主表示都已经做过了以后,帖子就坑了。倒是看到几个比较靠谱的中文博客(点击链接),但是和我的方法是一样的,删光重建嘛。

    不喜欢上Stack overflow的原因是,我遇到的问题一般都特别低级,我也不知道怎么描述,然后stac面的错误也高级,解决方法也高级,总是云里雾里然后在某个同为小白的csdn里面找到了答案。Stack里面搜了半天,搜到一个和我有类似问题的人(点击链接)。看红色框内,也是改了字段名然后报错说找不到原来的字段名(which 我俩也都没想用它啊)。

    不过这位小哥不是和我一样修改模型然后生成迁移的,而是直接写了迁移文件。

    解答区果然也抓住这点了,开始“delete-makemigrations-migrate三连”

    我都做了这些啊可是没有用啊.jpg 

    小哥的解决方法是recreate app,不过这也太麻烦了吧。不对!等等!我看到了什么?recreate?re!?

    ······ ???!!!

    天啦噜,我怎么忘记了重启大法!!!

    然后我满怀期待地关掉了pycharm,重新打开了项目。

    emmm,是在下输了(哭)。

    话说搜索资料的时候,很不爽的事情是,大家总是说works fine,works fine。然而我一点都不fine。

    展开全文
  • cobbler profile 查看配置信息列表 [root@192 kickstarts]# cobbler profile list CentOS-7-i386 [root@192 kickstarts]# cobbler profile edit --name=CentOS-7-i386 --kickstart=/var/lib/cobbler/kickstarts...

    cobbler profile 查看配置信息列表

    [root@192 kickstarts]# cobbler profile list
    
       CentOS-7-i386
    
    [root@192 kickstarts]# cobbler profile edit --name=CentOS-7-i386 --kickstart=/var/lib/cobbler/kickstarts/centos-7.cfg

     

    展开全文
  • 由于coreseek很久不更新了,这里说个规避的办法 这个错误是由于 全局扫描时 关键词不为空造成的一个bug sphinx已经修正,但是coreseek没人更新了,有空自己去解决下吧。。 ...暂时规避的方法,就是把keyword设置为...

     由于coreseek很久不更新了,这里说个规避的办法

    这个错误是由于

    全局扫描时 关键词不为空造成的一个bug sphinx已经修正,但是coreseek没人更新了,有空自己去解决下吧。。


    暂时规避的方法,就是把keyword设置为空

    $cl->SetMatchMode ( SPH_MATCH_FULLSCAN);
     
    $res = $cl->Query ( $keywords, "*" );



    展开全文
  • Uncaught Error: UNKNOWN: unknown error, lstat 'Y:\'" <p>that was thrown from the fuzzy-finder package. I'm creating an issue because ATOM suggested that I do so. Below is the ...
  • <p>oracle_fdw reports <code>ERROR: Internal oracle_fdw error: encountered unknown node type 144.</code></p> <p>oracle_diag output is: <code>oracle_fdw 2.2.0, PostgreSQL 12.1 (Ubuntu 12.1-1.pgdg18.04&#...
  • error: Unknown error (14001)

    2020-12-25 19:42:52
    Error: Unknown error (14001) at ChildProcess.spawn (internal/child_process.js:394:11) at Object.spawn (child_process.js:553:9) at Proxy.<anonymous> (C:\Program Files\Black Tree Gaming Ltd\...
  • Internal CLR error. (0x80131506) at ExCrypto.ChaCha20.get_CachedMasks() at ExCrypto.ChaCha20.DB_QUATERROUND(System.Runtime.Intrinsics.Vector256`1<uint32> ByRef, System.Runtime.Intrinsics....
  • Error:Internal error: (java.net.MalformedURLException) unknown protocol: jrt java.net.MalformedURLException: unknown protocol: jrt at java.net.URL.(URL.java:421) at java.net.URL.(URL.java:310) at ...
  • <p>Error: Uncaught (in promise): UnknownError: Internal error opening backing store for indexedDB.open. resolvePromise (file:///snap/superproductivity/623/resources/app.asar/dist/webpack:/node_modules...
  • Error: Unknown signal: 143

    2020-12-02 08:15:04
    Error: Unknown signal: 143 at process.ChildProcess.kill (internal/child_process.js:361:11) at emitOne (events.js:83:20) at process.emit (events.js:170:7) at process.exit (node.js:763:17) at Child...
  • BotFrameworkAdapter.processActivity(): 500 ERROR - Error: Unknown (node:4468) UnhandledPromiseRejectionWarning: Error: Error: Unknown at BotFrameworkAdapter.processActivity (D:\home\site\wwwroot\node...
  • Error: Unknown platform: win32 at Object.<anonymous> (D:\Coding\NodeJS Projects\MediaSoupTest\node_modules\clang-tools-prebuilt\install.js:24:33) at Module._compile (internal/modules/cjs/...
  • [Play Games Plugin DLL] ERROR: Encountered unknown status: ERROR_INTERNAL 01-21 12:38:43.435: W/Unity(15526): 01-21 12:38:43.435: W/Unity(15526): (Filename: ./artifacts/generated/common/runtime/...
  • SSL connection error: unknown error number". This may be due to TLS versions or local CA certs. <h2>Suggested Resolution <ul><li>Add links or instructions for how to update your local cert.</li>...
  • 我一直很好奇如何抛出java.lang.InternalError或java.lang.UnknownError.我的意思并不简单throw new InternalError();throw new UnknownError();但是Java SE库或JVM本身抛出了一个(最近通常的Oracle实现).例如,使...
  • I originally thought this was an error in Unity in the way it was handling variables, but i wrote something using variables in a similar way, not using the FastNoiseLite HLSL library and i couldnt ...
  • <p>I posted this error in <a href="https://stackoverflow.com/questions/57063688/500-error-for-unknown-reason-after-restart-computer">stackoverflow</a> but no answer yet.</p><p>该提问来源于开源项目&#...
  • "Error: UNKNOWN" on run

    2020-11-29 21:39:41
    [2019-08-19T22:25:13.454] [ERROR] [TSED] - { Error: UNKNOWN: unknown error, open 'C:/.../AppData/Local/Temp/.ts-nodeQpTu9Z/compiled\3593206440344747.req' at Object.openSync (fs.js:443:3) at ...

空空如也

空空如也

1 2 3 4 5 ... 20
收藏数 8,656
精华内容 3,462
关键字:

errorinternalunknown