精华内容
下载资源
问答
  • 2019-09-18 00:08:27

    有时候,我们习惯了用root权限去启动was服务,但是,这就有一个问题,root启动之后下次再用was用户启动服务的时候会导致服务起不来。

    原因:

    root启动过后,会将概要目录下的文件权限更为root,导致其他非root用户启动时无法写入日志。

    解决办法:

    将概要文件目录授权给其他非root用户即可。

    chown -R wasusr:wasgrop /home/wasusr

    其中wasusr为用户,wasgrop为用户组;

     

    平常我们操作中,最好su 到wasusr用户下执行启动was服务。

    su - wasadmin
    
    ./startManager.sh
    ./startServer.sh server1

     

    更多相关内容
  • 例如有的网友就反映说自己的win7旗舰版电脑出现了,右键运行网站的时候,提示计算机“.”上没有找到WAS服务的情况,该怎么解决呢?下面本文就来为大家分享关于win7 64位计算机没找到was服务的处理方法。解决方法...

    win7系统凭借良好的兼容性和稳定性现在还受到很多用户欢迎,但使用久了之后难免会出现一些问题。例如有的网友就反映说自己的win7旗舰版电脑出现了,右键运行网站的时候,提示在计算机“.”上没有找到WAS服务的情况,该怎么解决呢?下面本文就来为大家分享关于win7 64位在计算机没找到was服务的处理方法。

    解决方法如下:

    1、在安装完IIS,添加了网站之后,网站图标上有一个红叉×,单击右键,启动,会提示:在计算机“.”上没有找到WAS服务。

    1bbc4f5cf05c9c375838b64b2da03477.png

    2、打开控制面板,点击添加或删除程序,选择打开或关闭windows功能。

    fb3ccbf172861cbdc9195b45f77dfb02.png

    3、勾选internet信息服务、microsoft.net framework3.5.1下面的所有选项。

    a64ea0afbf7b34349e4b60f7109e952c.png

    4、点击下一步,系统自动安装相应的控件。

    d0837fbda2e2570d18ba326934499280.png

    5、此时,再次单击右键,管理网站——启动。

    eb4c6302883fb0f30b15e97c08595319.png

    6、提示,另一个程序正在占用此文件。

    75c302aa96b5e3c0c920a05bba070fd2.png

    7、删除网站,再次添加网站就可以运行。

    8a8e878f065d8b75259bba1e7583ecef.png

    win764位在计算机没找到was服务的解决方法就为大家分享到这里啦,有出现同样情况的可以按照上面的方法来解决哦。

    展开全文
  • e69da5e887aa3231313335323631343130323136353331333431346364年份前im,月份前in,年月前in,季节前in;日前on,月目前on,年月日前on,星期前on,以Day结尾的节日前om。例:in 2008;in ...

    展开全部

    一、on用于具体的某一天(上、下午和晚上)前。在e69da5e887aa3231313335323631343130323136353331333431346364年份前用im,月份前

    用in,年月前用in,季节前用in;在日前用on,月目前用on,年月日前用on,星期前用on,以Day结尾的节日前用om。例:

    in 2008;in spring/summer/autumn/winter;in September;in September, 2008;on September 10th;on September 10th, 2003, on Monday/Tuesday;on Christmas Day; on Women' s Day,on National Day(在国庆节那天)

    二、morning, afternoon, evening Hi this, that, next, last, tomorrow,yesterday等词限定时,则前面一律不用介词。例:

    1、The boy was later for class this morning.

    这个男孩今天早上上学迟到了。

    2、Last Wednesday Lucy didn t go to school, because she was ill.

    上个星期三露西没上学,因为她生病了。

    3、I shall give a talk nert Thesday morning.

    下周二上午我要作报告。

    4、Tomorrow afernoon we are going to watch a football match.

    明天下午我们将看一场足球赛。

    5、There was an accident on this street that afternoon.

    那天下午在这条街上发生了一起车祸。

    三、在时间点前常用介词at,例:

    at six o clock; at half past eight, at ten to nine; at a quarter pasteleven; at twelve twenty.

    四、其他情况。例:

    1、My family moved to France in that summer.

    那个夏天我们家搬到了法国。( in that summer表特指)

    2、How many minutes are there in an hour?一小时有多少分钟? (in an hour表泛指)

    3、What day is it todav?

    今天星期几今天是什么节日?

    It is Tuesday/Children’sDay.

    今天是星期二/儿童节。(I指 Tuesday或 Children's day故Tuesday或 Children Day前不加on)

    4、My birthday is on October Ist.

    10月1日是我的生日。( My birthday前不加on)

    5、Let s make it nine forty.

    我们把时间定在9:40吧。(it指 nineforty,故 nine forty前不加at)

    6、It rained heavily last night.

    昨晚雨下得很大。( last night不能写成yesterday night)

    7、We’Il leave here tomorrow morning.

    明早我们将离开这里。( tomorrow morning不能写成 next morning)

    展开全文
  • MAVEN clean install 的时候报错了ERROR:Failed to execute goal org.apache.maven.plugins:maven-compiler-plugin:3.7.0:compile (default-compile) on project yhzq-base: Execution default-compile of goal ...

    MAVEN在 clean install 的时候报错了ERROR:Failed to execute goal org.apache.maven.plugins:maven-compiler-plugin:3.7.0:compile (default-compile) on project yhzq-base: Execution default-compile of goal org.apache.maven.plugins:maven-compiler-plugin:3.7.0:compile failed: A required class was missing while executing org.apache.maven.plugins:maven-compiler-plugin:3.7.0:compile: org/codehaus/plexus/compiler/manager/NoSuchCompilerException

    求大神们帮忙看一下 下面的是错误提示 JDK版本已经换了好几个了,maven版本也换过都没用

    [WARNING] 
    [WARNING] Some problems were encountered while building the effective settings
    [WARNING] expected START_TAG or END_TAG not TEXT (position: TEXT seen ...ifacts.\n   |\n   | Default: ${user.home}/.m2/repository \n     \n  <l... @54:5)  @ F:\maven\apache-maven-3.6.3\conf\settings.xml, line 54, column 5
    [WARNING] expected START_TAG or END_TAG not TEXT (position: TEXT seen ...ifacts.\n   |\n   | Default: ${user.home}/.m2/repository \n     \n  <l... @54:5)  @ F:\maven\apache-maven-3.6.3\conf\settings.xml, line 54, column 5
    [WARNING] 
    [INFO] Scanning for projects...
    [WARNING] 
    [WARNING] Some problems were encountered while building the effective model for com.yhzq:yhzq-base:jar:1.0.1
    [WARNING] 'dependencies.dependency.(groupId:artifactId:type:classifier)' must be unique: com.aliyun:aliyun-java-sdk-core:jar -> duplicate declaration of version 4.3.3 @ line 218, column 21
    [WARNING] 
    [WARNING] It is highly recommended to fix these problems because they threaten the stability of your build.
    [WARNING] 
    [WARNING] For this reason, future Maven versions might no longer support building such malformed projects.
    [WARNING] 
    [INFO] 
    [INFO] -------------------------< com.yhzq:yhzq-base >-------------------------
    [INFO] Building yhzq-base 1.0.1
    [INFO] --------------------------------[ jar ]---------------------------------
    [INFO] 
    [INFO] --- maven-clean-plugin:3.0.0:clean (default-clean) @ yhzq-base ---
    [INFO] Deleting F:\wixh-parent\yhzq-base\target
    [INFO] 
    [INFO] --- maven-resources-plugin:3.0.2:resources (default-resources) @ yhzq-base ---
    [INFO] Using 'UTF-8' encoding to copy filtered resources.
    [INFO] Copying 7 resources
    [INFO] Copying 1 resource
    [INFO] 
    [INFO] --- maven-compiler-plugin:3.7.0:compile (default-compile) @ yhzq-base ---
    [WARNING] The POM for org.codehaus.plexus:plexus-java:jar:0.9.2 is invalid, transitive dependencies (if any) will not be available, enable debug logging for more details
    [WARNING] The POM for org.codehaus.plexus:plexus-compiler-api:jar:2.8.2 is invalid, transitive dependencies (if any) will not be available, enable debug logging for more details
    [WARNING] The POM for org.codehaus.plexus:plexus-compiler-manager:jar:2.8.2 is invalid, transitive dependencies (if any) will not be available, enable debug logging for more details
    [WARNING] The POM for org.codehaus.plexus:plexus-compiler-javac:jar:2.8.2 is invalid, transitive dependencies (if any) will not be available, enable debug logging for more details
    [WARNING] Error injecting: org.apache.maven.plugin.compiler.CompilerMojo
    java.lang.NoClassDefFoundError: org/codehaus/plexus/compiler/manager/NoSuchCompilerException
        at java.lang.Class.getDeclaredConstructors0 (Native Method)
        at java.lang.Class.privateGetDeclaredConstructors (Class.java:2671)
        at java.lang.Class.getDeclaredConstructors (Class.java:2020)
        at com.google.inject.spi.InjectionPoint.forConstructorOf (InjectionPoint.java:245)
        at com.google.inject.internal.ConstructorBindingImpl.create (ConstructorBindingImpl.java:115)
        at com.google.inject.internal.InjectorImpl.createUninitializedBinding (InjectorImpl.java:706)
        at com.google.inject.internal.InjectorImpl.createJustInTimeBinding (InjectorImpl.java:930)
        at com.google.inject.internal.InjectorImpl.createJustInTimeBindingRecursive (InjectorImpl.java:852)
        at com.google.inject.internal.InjectorImpl.getJustInTimeBinding (InjectorImpl.java:291)
        at com.google.inject.internal.InjectorImpl.getBindingOrThrow (InjectorImpl.java:222)
        at com.google.inject.internal.InjectorImpl.getProviderOrThrow (InjectorImpl.java:1040)
        at com.google.inject.internal.InjectorImpl.getProvider (InjectorImpl.java:1071)
        at com.google.inject.internal.InjectorImpl.getProvider (InjectorImpl.java:1034)
        at com.google.inject.internal.InjectorImpl.getInstance (InjectorImpl.java:1086)
        at org.eclipse.sisu.space.AbstractDeferredClass.get (AbstractDeferredClass.java:48)
        at com.google.inject.internal.ProviderInternalFactory.provision (ProviderInternalFactory.java:85)
        at com.google.inject.internal.InternalFactoryToInitializableAdapter.provision (InternalFactoryToInitializableAdapter.java:57)
        at com.google.inject.internal.ProviderInternalFactory$1.call (ProviderInternalFactory.java:66)
        at com.google.inject.internal.ProvisionListenerStackCallback$Provision.provision (ProvisionListenerStackCallback.java:112)
        at com.google.inject.internal.ProvisionListenerStackCallback$Provision.provision (ProvisionListenerStackCallback.java:127)
        at com.google.inject.internal.ProvisionListenerStackCallback.provision (ProvisionListenerStackCallback.java:66)
        at com.google.inject.internal.ProviderInternalFactory.circularGet (ProviderInternalFactory.java:61)
        at com.google.inject.internal.InternalFactoryToInitializableAdapter.get (InternalFactoryToInitializableAdapter.java:47)
        at com.google.inject.internal.InjectorImpl$1.get (InjectorImpl.java:1050)
        at org.eclipse.sisu.inject.Guice4$1.get (Guice4.java:162)
        at org.eclipse.sisu.inject.LazyBeanEntry.getValue (LazyBeanEntry.java:81)
        at org.eclipse.sisu.plexus.LazyPlexusBean.getValue (LazyPlexusBean.java:51)
        at org.codehaus.plexus.DefaultPlexusContainer.lookup (DefaultPlexusContainer.java:263)
        at org.codehaus.plexus.DefaultPlexusContainer.lookup (DefaultPlexusContainer.java:255)
        at org.apache.maven.plugin.internal.DefaultMavenPluginManager.getConfiguredMojo (DefaultMavenPluginManager.java:520)
        at org.apache.maven.plugin.DefaultBuildPluginManager.executeMojo (DefaultBuildPluginManager.java:124)
        at org.apache.maven.lifecycle.internal.MojoExecutor.execute (MojoExecutor.java:210)
        at org.apache.maven.lifecycle.internal.MojoExecutor.execute (MojoExecutor.java:156)
        at org.apache.maven.lifecycle.internal.MojoExecutor.execute (MojoExecutor.java:148)
        at org.apache.maven.lifecycle.internal.LifecycleModuleBuilder.buildProject (LifecycleModuleBuilder.java:117)
        at org.apache.maven.lifecycle.internal.LifecycleModuleBuilder.buildProject (LifecycleModuleBuilder.java:81)
        at org.apache.maven.lifecycle.internal.builder.singlethreaded.SingleThreadedBuilder.build (SingleThreadedBuilder.java:56)
        at org.apache.maven.lifecycle.internal.LifecycleStarter.execute (LifecycleStarter.java:128)
        at org.apache.maven.DefaultMaven.doExecute (DefaultMaven.java:305)
        at org.apache.maven.DefaultMaven.doExecute (DefaultMaven.java:192)
        at org.apache.maven.DefaultMaven.execute (DefaultMaven.java:105)
        at org.apache.maven.cli.MavenCli.execute (MavenCli.java:957)
        at org.apache.maven.cli.MavenCli.doMain (MavenCli.java:289)
        at org.apache.maven.cli.MavenCli.main (MavenCli.java:193)
        at sun.reflect.NativeMethodAccessorImpl.invoke0 (Native Method)
        at sun.reflect.NativeMethodAccessorImpl.invoke (NativeMethodAccessorImpl.java:62)
        at sun.reflect.DelegatingMethodAccessorImpl.invoke (DelegatingMethodAccessorImpl.java:43)
        at java.lang.reflect.Method.invoke (Method.java:498)
        at org.codehaus.plexus.classworlds.launcher.Launcher.launchEnhanced (Launcher.java:282)
        at org.codehaus.plexus.classworlds.launcher.Launcher.launch (Launcher.java:225)
        at org.codehaus.plexus.classworlds.launcher.Launcher.mainWithExitCode (Launcher.java:406)
        at org.codehaus.plexus.classworlds.launcher.Launcher.main (Launcher.java:347)
        at org.codehaus.classworlds.Launcher.main (Launcher.java:47)
    Caused by: java.lang.ClassNotFoundException: org.codehaus.plexus.compiler.manager.NoSuchCompilerException
        at org.codehaus.plexus.classworlds.strategy.SelfFirstStrategy.loadClass (SelfFirstStrategy.java:50)
        at org.codehaus.plexus.classworlds.realm.ClassRealm.unsynchronizedLoadClass (ClassRealm.java:271)
        at org.codehaus.plexus.classworlds.realm.ClassRealm.loadClass (ClassRealm.java:247)
        at org.codehaus.plexus.classworlds.realm.ClassRealm.loadClass (ClassRealm.java:239)
        at java.lang.Class.getDeclaredConstructors0 (Native Method)
        at java.lang.Class.privateGetDeclaredConstructors (Class.java:2671)
        at java.lang.Class.getDeclaredConstructors (Class.java:2020)
        at com.google.inject.spi.InjectionPoint.forConstructorOf (InjectionPoint.java:245)
        at com.google.inject.internal.ConstructorBindingImpl.create (ConstructorBindingImpl.java:115)
        at com.google.inject.internal.InjectorImpl.createUninitializedBinding (InjectorImpl.java:706)
        at com.google.inject.internal.InjectorImpl.createJustInTimeBinding (InjectorImpl.java:930)
        at com.google.inject.internal.InjectorImpl.createJustInTimeBindingRecursive (InjectorImpl.java:852)
        at com.google.inject.internal.InjectorImpl.getJustInTimeBinding (InjectorImpl.java:291)
        at com.google.inject.internal.InjectorImpl.getBindingOrThrow (InjectorImpl.java:222)
        at com.google.inject.internal.InjectorImpl.getProviderOrThrow (InjectorImpl.java:1040)
        at com.google.inject.internal.InjectorImpl.getProvider (InjectorImpl.java:1071)
        at com.google.inject.internal.InjectorImpl.getProvider (InjectorImpl.java:1034)
        at com.google.inject.internal.InjectorImpl.getInstance (InjectorImpl.java:1086)
        at org.eclipse.sisu.space.AbstractDeferredClass.get (AbstractDeferredClass.java:48)
        at com.google.inject.internal.ProviderInternalFactory.provision (ProviderInternalFactory.java:85)
        at com.google.inject.internal.InternalFactoryToInitializableAdapter.provision (InternalFactoryToInitializableAdapter.java:57)
        at com.google.inject.internal.ProviderInternalFactory$1.call (ProviderInternalFactory.java:66)
        at com.google.inject.internal.ProvisionListenerStackCallback$Provision.provision (ProvisionListenerStackCallback.java:112)
        at com.google.inject.internal.ProvisionListenerStackCallback$Provision.provision (ProvisionListenerStackCallback.java:127)
        at com.google.inject.internal.ProvisionListenerStackCallback.provision (ProvisionListenerStackCallback.java:66)
        at com.google.inject.internal.ProviderInternalFactory.circularGet (ProviderInternalFactory.java:61)
        at com.google.inject.internal.InternalFactoryToInitializableAdapter.get (InternalFactoryToInitializableAdapter.java:47)
        at com.google.inject.internal.InjectorImpl$1.get (InjectorImpl.java:1050)
        at org.eclipse.sisu.inject.Guice4$1.get (Guice4.java:162)
        at org.eclipse.sisu.inject.LazyBeanEntry.getValue (LazyBeanEntry.java:81)
        at org.eclipse.sisu.plexus.LazyPlexusBean.getValue (LazyPlexusBean.java:51)
        at org.codehaus.plexus.DefaultPlexusContainer.lookup (DefaultPlexusContainer.java:263)
        at org.codehaus.plexus.DefaultPlexusContainer.lookup (DefaultPlexusContainer.java:255)
        at org.apache.maven.plugin.internal.DefaultMavenPluginManager.getConfiguredMojo (DefaultMavenPluginManager.java:520)
        at org.apache.maven.plugin.DefaultBuildPluginManager.executeMojo (DefaultBuildPluginManager.java:124)
        at org.apache.maven.lifecycle.internal.MojoExecutor.execute (MojoExecutor.java:210)
        at org.apache.maven.lifecycle.internal.MojoExecutor.execute (MojoExecutor.java:156)
        at org.apache.maven.lifecycle.internal.MojoExecutor.execute (MojoExecutor.java:148)
        at org.apache.maven.lifecycle.internal.LifecycleModuleBuilder.buildProject (LifecycleModuleBuilder.java:117)
        at org.apache.maven.lifecycle.internal.LifecycleModuleBuilder.buildProject (LifecycleModuleBuilder.java:81)
        at org.apache.maven.lifecycle.internal.builder.singlethreaded.SingleThreadedBuilder.build (SingleThreadedBuilder.java:56)
        at org.apache.maven.lifecycle.internal.LifecycleStarter.execute (LifecycleStarter.java:128)
        at org.apache.maven.DefaultMaven.doExecute (DefaultMaven.java:305)
        at org.apache.maven.DefaultMaven.doExecute (DefaultMaven.java:192)
        at org.apache.maven.DefaultMaven.execute (DefaultMaven.java:105)
        at org.apache.maven.cli.MavenCli.execute (MavenCli.java:957)
        at org.apache.maven.cli.MavenCli.doMain (MavenCli.java:289)
        at org.apache.maven.cli.MavenCli.main (MavenCli.java:193)
        at sun.reflect.NativeMethodAccessorImpl.invoke0 (Native Method)
        at sun.reflect.NativeMethodAccessorImpl.invoke (NativeMethodAccessorImpl.java:62)
        at sun.reflect.DelegatingMethodAccessorImpl.invoke (DelegatingMethodAccessorImpl.java:43)
        at java.lang.reflect.Method.invoke (Method.java:498)
        at org.codehaus.plexus.classworlds.launcher.Launcher.launchEnhanced (Launcher.java:282)
        at org.codehaus.plexus.classworlds.launcher.Launcher.launch (Launcher.java:225)
        at org.codehaus.plexus.classworlds.launcher.Launcher.mainWithExitCode (Launcher.java:406)
        at org.codehaus.plexus.classworlds.launcher.Launcher.main (Launcher.java:347)
        at org.codehaus.classworlds.Launcher.main (Launcher.java:47)
    [INFO] ------------------------------------------------------------------------
    [INFO] BUILD FAILURE
    [INFO] ------------------------------------------------------------------------
    [INFO] Total time:  4.173 s
    [INFO] Finished at: 2020-05-20T13:57:47+08:00
    [INFO] ------------------------------------------------------------------------
    [ERROR] Failed to execute goal org.apache.maven.plugins:maven-compiler-plugin:3.7.0:compile (default-compile) on project yhzq-base: Execution default-compile of goal org.apache.maven.plugins:maven-compiler-plugin:3.7.0:compile failed: A required class was missing while executing org.apache.maven.plugins:maven-compiler-plugin:3.7.0:compile: org/codehaus/plexus/compiler/manager/NoSuchCompilerException
    [ERROR] -----------------------------------------------------
    [ERROR] realm =    plugin>org.apache.maven.plugins:maven-compiler-plugin:3.7.0
    [ERROR] strategy = org.codehaus.plexus.classworlds.strategy.SelfFirstStrategy
    [ERROR] urls[0] = file:/F:/repository_boot/org/apache/maven/plugins/maven-compiler-plugin/3.7.0/maven-compiler-plugin-3.7.0.jar
    [ERROR] urls[1] = file:/F:/repository_boot/org/sonatype/sisu/sisu-inject-bean/1.4.2/sisu-inject-bean-1.4.2.jar
    [ERROR] urls[2] = file:/F:/repository_boot/org/sonatype/sisu/sisu-guice/2.1.7/sisu-guice-2.1.7-noaop.jar
    [ERROR] urls[3] = file:/F:/repository_boot/org/codehaus/plexus/plexus-utils/2.0.4/plexus-utils-2.0.4.jar
    [ERROR] urls[4] = file:/F:/repository_boot/org/sonatype/aether/aether-util/1.7/aether-util-1.7.jar
    [ERROR] urls[5] = file:/F:/repository_boot/org/codehaus/plexus/plexus-interpolation/1.14/plexus-interpolation-1.14.jar
    [ERROR] urls[6] = file:/F:/repository_boot/org/codehaus/plexus/plexus-component-annotations/1.6/plexus-component-annotations-1.6.jar
    [ERROR] urls[7] = file:/F:/repository_boot/org/sonatype/plexus/plexus-sec-dispatcher/1.3/plexus-sec-dispatcher-1.3.jar
    [ERROR] urls[8] = file:/F:/repository_boot/org/sonatype/plexus/plexus-cipher/1.4/plexus-cipher-1.4.jar
    [ERROR] urls[9] = file:/F:/repository_boot/org/apache/maven/shared/maven-shared-utils/3.1.0/maven-shared-utils-3.1.0.jar
    [ERROR] urls[10] = file:/F:/repository_boot/commons-io/commons-io/2.5/commons-io-2.5.jar
    [ERROR] urls[11] = file:/F:/repository_boot/org/apache/maven/shared/maven-shared-incremental/1.1/maven-shared-incremental-1.1.jar
    [ERROR] urls[12] = file:/F:/repository_boot/org/codehaus/plexus/plexus-java/0.9.2/plexus-java-0.9.2.jar
    [ERROR] urls[13] = file:/F:/repository_boot/org/codehaus/plexus/plexus-compiler-api/2.8.2/plexus-compiler-api-2.8.2.jar
    [ERROR] urls[14] = file:/F:/repository_boot/org/codehaus/plexus/plexus-compiler-manager/2.8.2/plexus-compiler-manager-2.8.2.jar
    [ERROR] urls[15] = file:/F:/repository_boot/org/codehaus/plexus/plexus-compiler-javac/2.8.2/plexus-compiler-javac-2.8.2.jar
    [ERROR] Number of foreign imports: 1
    [ERROR] import: Entry[import  from realm ClassRealm[maven.api, parent: null]]
    [ERROR] 
    [ERROR] -----------------------------------------------------
    [ERROR] : org.codehaus.plexus.compiler.manager.NoSuchCompilerException
    [ERROR] -> [Help 1]
    [ERROR] 
    [ERROR] To see the full stack trace of the errors, re-run Maven with the -e switch.
    [ERROR] Re-run Maven using the -X switch to enable full debug logging.
    [ERROR] 
    [ERROR] For more information about the errors and possible solutions, please read the following articles:
    [ERROR] [Help 1] http://cwiki.apache.org/confluence/display/MAVEN/PluginContainerException
    
    
    展开全文
  • 如果你七夕(没错就是2020年8月14日)的这一天刚好加班,又刚好去访问了全球最大的同性交友网站,又刚好去更新提交代码,又或你创建了一个新的仓库送给自己,又刚好想把这个仓库送给(push)github,你就刚好会...
  • WAS集群搭建

    千次阅读 2018-12-05 10:12:43
    本例子选择WAS7版本的集群,生产环境其实基本上F5集群,不推荐用WAS集群,避免复杂化,IHS与WAS建议一对一, 常见的架构如下:但是本案例IHS和AppServer放在同一台服务器上。...在WAS目录下执行ro...
  • 如果你最近使用git命令,你会发现输入github的账号密码会报错。
  • Horizontal viewport was given unbounded height. ...写纵向或横向的布局的时候,一不小心就会遇到这个异常,宽度或高度溢出,导致widget不显示。 比如一个简单的例子: body: Column( children: <Widg...
  • Query execution was interrupted

    千次阅读 2021-11-01 00:39:32
    Message: Query execution was interrupted 异常原因 一、JDBC setQueryTimeout 如果设置了queryTimeout参数,JDBC后台会启动一个Timer,内部是一个CancelTask,当sql执行时间超过预设置的时间时会主动Kill query。...
  • WAS常用操作

    千次阅读 2018-12-04 07:45:39
    1、启动server .cd %WAS_HOME%/profiles/AppSrv01/bin ./startServer.sh server1 2、停止server ./stopServer.sh server1 -username admin -password xxxx ...做所有was前期操作前,请编辑/etc/hosts 中的主机...
  • terminl窗口中依次输入命令:git pullgit pull origin mastergit pull origin master --allow-unrelated-histories不用管输入命令中的警告啥的。应该可以解决的。3.idea中重新push自己的项目,成功!!...
  • 最近工作中遇到了一个Fegin传参异常,特此记录便于日后查阅。 java.lang.IllegalArgumentException: Body parameter 0 was null at feign.Util.checkArgument(Util.java:102) at feign.ReflectiveFeign$...
  • 现在一个properties文件来保存签名信息,然后保存本地,git提交的时候加入过滤,这样会增加签名的安全性。 具体代码如下 app的build.gradle文件中的android下面定义一个 def keystorePropertie...
  • 出现了Wrong number of parameters:excepted 0,was given 10 Query错误 原因是 sql 忘记书写了
  • E/flutter (17545): [ERROR:flutter/lib/ui/ui_dart_state.cc(157)] Unhandled Exception: ServicesBinding.defaultBinaryMessenger was accessed before the binding was initialized. E/flutt...
  • 卸载Python 3.6时错误提示,No Python 3.6 installation was detected。 解决办法是,先右键→更改→Repair。 然后再卸载,完成!
  • 配置Feign的时候报错PathVariable annotation was empty on param 0. 是声明Feign接口方法时候,使用@PathVariable注解没有带有value值。 将下面代码: @GetMapping("/dept/{id}") public Dept get(@...
  • 前端开发的时候,会遇到因为引入的文件路径不正确而造成的报错问题,这类问题前端开发过程中很常见,但是还是会遇到不少坑。那么本文就来分享一个关于前端开发过程中遇到This relative module was not found ...
  • WAS7和WAS8.5布署Axis2 webservice

    千次阅读 2019-01-15 16:56:53
    无论是was7还是was8,安装带有Axis2的应用时,都很容易出现jar冲突的情况,最常见的有以下: E com.ibm.ws.webcontainer.webapp.WebApp logServletError SRVE0293E: [Servlet 错误]-[AxisServlet]: org.apache....
  • Query was Empty异常

    千次阅读 2019-11-01 16:26:28
    发布测试的时候,居然出现个BUG:Query was Empty。 这样的信息乍一看,就觉得诡异,数据集合肯定是没有问题的,因为SQL都是客户端测试没问题了挪到项目里的。 细一看发现了猫腻,赋予查询条件的时候,复制...
  • 单点登录配置url的时候,访问一个url的时候会报如下的错误 2021-05-24 18:28:03.163 ERROR 17350 --- [nio-8082-exec-1] o.a.c.c.C.[.[.[.[dispatcherServlet] : Servlet.service() for servlet ...
  • Android Studio 配置OpenCV 的时候出现这样的提示 ,这个问题我自己的问题的是引入库问题出现的错误 最后自己把OpenCV4.4.0 下载的sdk 直接当成库引入到项目就好了 具体可以参考点击查看OpenCV4.4.0的配置 ...
  • Error: No default engine was specified and no extension was provided. 当express中使用art-template时出现以上出错,出错代码如下: //引入express const express = require('express'); // 数据存储 const ...
  • 这篇文章记录一下Maven一个简单错误的原因和对应方法 文章目录 现象 原因 对应 现象 编译的时候提示如下错误信息: [ERROR] Failed to execute goal on project Spring-boot-activiti: Could not resolve ...
  • 使用tensorflow训练模型的时候报如下错误 tensorflow.python.framework.errors_impl.InvalidArgumentError: No OpKernel was registered to support Op 'NcclAllReduce' used by node AllReduceGrads/...
  • was部署应用的时候,选择数据源

    千次阅读 2015-03-23 17:49:36
    在was上部署应用的时候,有些应用可以选择数据源,有些不可以, 下图是可以选择数据源的,   下图是不可以选择数据源的    想要可以选择数据源,只需要web.xml里面加入如下节点即可:&lt;!--...
  • 成功解决DataConversionWarning: A column-vector y was passed when a 1d array was expected. Please change 目录 解决问题 解决思路 解决方法 解决问题 sklearn\utils\validation.py:578: ...
  • Was855控制台查看日志中文乱码问题

    千次阅读 2020-01-07 15:15:24
    今天排查一个问题: 本地...到was控制台上查看时候就是乱码的。很难受。把was设置下显示中文把。 1.首先登录was控制台 2.打开 服务器-->WebSphere Application Server-->server1(此处是自己服务器名称) ...
  • The connection to the server localhost:8080 was refused - did you specify the right host or port? 原因: kubenetes master没有与本机绑定,集群初始化的时候没有设置 解决办法(执行以下命令): ...
  • 不建议root用户启动was服务

    千次阅读 2016-12-16 15:33:33
    发现大家总喜欢root权限去启动was服务,root启动之后下次再用was用户启动服务的时候会导致服务起不来。 原因: root启动过后,会将概要目录下的文件权限更为root,导致其他非root用户启动时无法写入日志。 解决...

空空如也

空空如也

1 2 3 4 5 ... 20
收藏数 280,969
精华内容 112,387
关键字:

在什么时候用was

友情链接: EMPCA.rar