精华内容
下载资源
问答
  • 在javascript中使用正则表达式匹配一段字符串时出现奇怪的现象,匹配结果为true和false反复出现。 javascript代码: function check() { var lists = document.getElementsByName("orders"); var flag = false...

    在javascript中使用正则表达式匹配一段字符串时出现奇怪的现象,匹配结果为true和false反复出现。

    javascript代码:

    function check() {
    		var lists = document.getElementsByName("orders");
    		var flag = false;
    		var pattern = /^(\d+)$/ig;
    		for(var v = 0; v < lists.length; ++v) {
    			var val = lists[v].value;
    			var result = pattern.test(val);
    			alert("-" + result + "-" + val + "-" + v + "-");
    			if(tt) {
    				if(val != 0) {
    					flag == true;
    				}
    			} else {
    				alert("订货量填写有误,请仔细核对!");
    				//return false;
    			}
    		}
    		if(flag == false) {
    			alert("此次没有订货数量,请核对!");
    		}
    	}


    其中result反复为true和false,查看w3c,找到以下提示:



    所以,解决此问题,可以去掉pattern后面的g,或者在pattern执行完后手动将lastIndex置为0。


    展开全文
  • 可能是因为先安装过Office2003的原因,打开Microsoft Office2007时每次是都会... 那么如何解决Office2007反复出现配置进度的问题呢?下面进入正题,具体操作如下: 直接进入目录”C:/Program Files/Co

    可能是因为先安装过Office2003的原因,打开Microsoft Office2007时每次是都会出现配置进度,电脑慢的每次都在等很久,严重影响工作,在百度上搜索了一下,基本上都是说删除后在再重新安装一次,试过几次好像不能解决这个问题,有时有效,但大多数情况下解不了,可能是删除的不彻底呵呵,后来找到一个很简单的办法,与大家分享一下。

    那么如何解决Office2007反复出现配置进度的问题呢?下面进入正题,具体操作如下:

    直接进入目录”C:/Program Files/Common Files/microsoft shared/OFFICE12/Office Setup Controller”,(是不是觉得这个地址不好找,简单呀,把这个地址复制到IE地址打开就行了)把SETUP.EXE程序重命名,比如SETUPA.EXE,现在好了,快试试看

     

    如果过段时间问题仍旧重现 

    请试试在开始运行输入:(新浪网友提供未经测试)

    reg add HKCU/Software/Microsoft/Office/12.0/Word/Options /v NoReReg /t REG_DWORD /d 1

    展开全文
  • VM虚拟机启用MAC系统出现 五国语言问题 反复重启 解决方案:(现在的解决方案是我自己使用的,实测有效) 1.出现五国语言问题后,直接卸载VM虚拟机,然后重新安装 2.安装VM虚拟机完成后,不要打开虚拟机连接MAC 3.在...

    VM虚拟机启用MAC系统出现 五国语言问题 反复重启
    解决方案:(现在的解决方案是我自己使用的,实测有效)
    1.出现五国语言问题后,直接卸载VM虚拟机,然后重新安装
    2.安装VM虚拟机完成后,不要打开虚拟机连接MAC
    3.在虚拟机文件中找到(unlocker-master——unlocker.exe)unlocker.exe,右击单击管理员运行,运行完成自动退出
    4.打开VM虚拟机找到.vmx文件,启动MAC,正常运行
    注明:之前我出现五国语言,不卸载虚拟机,直接运行unlocker.exe,所以务必重新安装一次虚拟机,祝各位好运,这虚拟机安装的真的费劲

    展开全文
  • 最近多次安装卸载Anaconda2和Anaconda3,导致重新安装时老是出现两个问题,其中一个问题是Anaconda装完后,打开Anaconda Navigator报错,无法启动;令一个问题是Jupyter Notebook打开后显示kernel dead,防止以后...

    最近多次安装卸载Anaconda2和Anaconda3,导致重新安装时老是出现两个问题,其中一个问题是Anaconda装完后,打开Anaconda Navigator报错,无法启动;令一个问题是Jupyter Notebook打开后显示kernel dead,防止以后再次遇到手足无措,在此写下解决方法。

    1.Navigator Error:An unexpected error occurred on Navigator start-up

    报错信息如下:

    Main Error
    could not determine a constructor for the tag 'tag:yaml.org,2002:python/unicode'
      in "C:\Users\Zheng Chen\AppData\Local\ContinuumIO\binstar\config.yaml", line 1, column 1
    Traceback
    Traceback (most recent call last):
      File "C:\ProgramData\Anaconda2\lib\site-packages\anaconda_navigator\exceptions.py", line 75, in exception_handler
        return_value = func(*args, **kwargs)
      File "C:\ProgramData\Anaconda2\lib\site-packages\anaconda_navigator\app\start.py", line 138, in start_app
        window = run_app(splash)
      File "C:\ProgramData\Anaconda2\lib\site-packages\anaconda_navigator\app\start.py", line 64, in run_app
        window = MainWindow(splash=splash, tab_project=False)
      File "C:\ProgramData\Anaconda2\lib\site-packages\anaconda_navigator\widgets\main_window.py", line 163, in __init__
        self.api = AnacondaAPI()
      File "C:\ProgramData\Anaconda2\lib\site-packages\anaconda_navigator\api\anaconda_api.py", line 2127, in AnacondaAPI
        ANACONDA_API = _AnacondaAPI()
      File "C:\ProgramData\Anaconda2\lib\site-packages\anaconda_navigator\api\anaconda_api.py", line 90, in __init__
        self._client_api = ClientAPI()
      File "C:\ProgramData\Anaconda2\lib\site-packages\anaconda_navigator\api\client_api.py", line 638, in ClientAPI
        CLIENT_API = _ClientAPI()
      File "C:\ProgramData\Anaconda2\lib\site-packages\anaconda_navigator\api\client_api.py", line 93, in __init__
        self.reload_binstar_client()
      File "C:\ProgramData\Anaconda2\lib\site-packages\anaconda_navigator\api\client_api.py", line 305, in reload_binstar_client
        config = binstar_client.utils.get_config()
      File "C:\ProgramData\Anaconda2\lib\site-packages\binstar_client\utils\config.py", line 229, in get_config
        file_configs = load_file_configs(SEARCH_PATH)
      File "C:\ProgramData\Anaconda2\lib\site-packages\binstar_client\utils\config.py", line 223, in load_file_configs
        raw_data = collections.OrderedDict(kv for kv in itertools.chain.from_iterable(load_paths))
      File "C:\ProgramData\Anaconda2\lib\collections.py", line 69, in __init__
        self.__update(*args, **kwds)
      File "C:\ProgramData\Anaconda2\lib\_abcoll.py", line 571, in update
        for key, value in other:
      File "C:\ProgramData\Anaconda2\lib\site-packages\binstar_client\utils\config.py", line 223, in 
        raw_data = collections.OrderedDict(kv for kv in itertools.chain.from_iterable(load_paths))
      File "C:\ProgramData\Anaconda2\lib\site-packages\binstar_client\utils\config.py", line 203, in _dir_yaml_loader
        yield filepath, load_config(filepath)
      File "C:\ProgramData\Anaconda2\lib\site-packages\binstar_client\utils\config.py", line 187, in load_config
        data = yaml_load(fd)
      File "C:\ProgramData\Anaconda2\lib\site-packages\binstar_client\utils\yaml.py", line 9, in yaml_load
        return safe_load(stream)
      File "C:\ProgramData\Anaconda2\lib\site-packages\yaml\__init__.py", line 93, in safe_load
        return load(stream, SafeLoader)
      File "C:\ProgramData\Anaconda2\lib\site-packages\yaml\__init__.py", line 71, in load
        return loader.get_single_data()
      File "C:\ProgramData\Anaconda2\lib\site-packages\yaml\constructor.py", line 39, in get_single_data
        return self.construct_document(node)
      File "C:\ProgramData\Anaconda2\lib\site-packages\yaml\constructor.py", line 48, in construct_document
        for dummy in generator:
      File "C:\ProgramData\Anaconda2\lib\site-packages\yaml\constructor.py", line 398, in construct_yaml_map
        value = self.construct_mapping(node)
      File "C:\ProgramData\Anaconda2\lib\site-packages\yaml\constructor.py", line 208, in construct_mapping
        return BaseConstructor.construct_mapping(self, node, deep=deep)
      File "C:\ProgramData\Anaconda2\lib\site-packages\yaml\constructor.py", line 127, in construct_mapping
        key = self.construct_object(key_node, deep=deep)
      File "C:\ProgramData\Anaconda2\lib\site-packages\yaml\constructor.py", line 88, in construct_object
        data = constructor(self, node)
      File "C:\ProgramData\Anaconda2\lib\site-packages\yaml\constructor.py", line 414, in construct_undefined
        node.start_mark)
    ConstructorError: could not determine a constructor for the tag 'tag:yaml.org,2002:python/unicode'

      in "C:\Users\Zheng Chen\AppData\Local\ContinuumIO\binstar\config.yaml", line 1, column 1

    解决方法:

    windows下以管理员身份打开Anaconda Prompt,然后逐个输入下面的语句,进行更新(linux或Max下直接在终端输入即可)

    conda update conda
    conda update anaconda-navigator
    conda update navigator-updater

    若还是不行,再输入以下语句:

    conda install anaconda-client=1.6.14

    2.kernel dead(Kernel error)


    报错信息如下:

    Traceback (most recent call last):
    File "C:\ProgramData\Anaconda2\lib\site-packages\tornado\web.py", line 1512, in _execute
    result = yield result
    File "C:\ProgramData\Anaconda2\lib\site-packages\tornado\gen.py", line 1055, in run
    value = future.result()
    File "C:\ProgramData\Anaconda2\lib\site-packages\tornado\concurrent.py", line 238, in result
    raise_exc_info(self._exc_info)
    File "C:\ProgramData\Anaconda2\lib\site-packages\tornado\gen.py", line 1063, in run
    yielded = self.gen.throw(*exc_info)
    File "C:\ProgramData\Anaconda2\lib\site-packages\notebook\services\sessions\handlers.py", line 73, in post
    type=mtype))
    File "C:\ProgramData\Anaconda2\lib\site-packages\tornado\gen.py", line 1055, in run
    value = future.result()
    File "C:\ProgramData\Anaconda2\lib\site-packages\tornado\concurrent.py", line 238, in result
    raise_exc_info(self._exc_info)
    File "C:\ProgramData\Anaconda2\lib\site-packages\tornado\gen.py", line 1063, in run
    yielded = self.gen.throw(*exc_info)
    File "C:\ProgramData\Anaconda2\lib\site-packages\notebook\services\sessions\sessionmanager.py", line 79, in create_session
    kernel_id = yield self.start_kernel_for_session(session_id, path, name, type, kernel_name)
    File "C:\ProgramData\Anaconda2\lib\site-packages\tornado\gen.py", line 1055, in run
    value = future.result()
    File "C:\ProgramData\Anaconda2\lib\site-packages\tornado\concurrent.py", line 238, in result
    raise_exc_info(self._exc_info)
    File "C:\ProgramData\Anaconda2\lib\site-packages\tornado\gen.py", line 1063, in run
    yielded = self.gen.throw(*exc_info)
    File "C:\ProgramData\Anaconda2\lib\site-packages\notebook\services\sessions\sessionmanager.py", line 92, in start_kernel_for_session
    self.kernel_manager.start_kernel(path=kernel_path, kernel_name=kernel_name)
    File "C:\ProgramData\Anaconda2\lib\site-packages\tornado\gen.py", line 1055, in run
    value = future.result()
    File "C:\ProgramData\Anaconda2\lib\site-packages\tornado\concurrent.py", line 238, in result
    raise_exc_info(self._exc_info)
    File "C:\ProgramData\Anaconda2\lib\site-packages\tornado\gen.py", line 307, in wrapper
    yielded = next(result)
    File "C:\ProgramData\Anaconda2\lib\site-packages\notebook\services\kernels\kernelmanager.py", line 148, in start_kernel
    super(MappingKernelManager, self).start_kernel(**kwargs)
    File "C:\ProgramData\Anaconda2\lib\site-packages\jupyter_client\multikernelmanager.py", line 110, in start_kernel
    km.start_kernel(**kwargs)
    File "C:\ProgramData\Anaconda2\lib\site-packages\jupyter_client\manager.py", line 258, in start_kernel
    **kw)
    File "C:\ProgramData\Anaconda2\lib\site-packages\jupyter_client\manager.py", line 203, in _launch_kernel
    return launch_kernel(kernel_cmd, **kw)
    File "C:\ProgramData\Anaconda2\lib\site-packages\jupyter_client\launcher.py", line 128, in launch_kernel
    proc = Popen(cmd, **kwargs)
    File "C:\ProgramData\Anaconda2\lib\subprocess.py", line 390, in init
    errread, errwrite)
    File "C:\ProgramData\Anaconda2\lib\subprocess.py", line 640, in _execute_child
    startupinfo)

    WindowsError: [Error 2]

    原因是python2.7和python3.6反复安装卸载的缘故(即Anaconda2和Anaconda3反复安装卸载的缘故),导致jupyter notebook没有读到正确的python 内核路径,解决方法如下:

    (1)在Anaconda Prompt中输入语句(对windows而言,linux或Max直接在终端输入查看)

    jupyter kernelspec list

    查看安装的内核及其位置,如果是反复安装会显示Python2和Python3两个内核及其所在路径

    (2)进入内核所在的目录,打开里面的kernel.jason文件,查看Python编译器的路径是否正确

    我现在安装的是Anaconda2,所对应的应该是Python2,所以直接把Python3那个文件夹删了,然后打开Python2文件夹中的kernel.jason文件时,发现内核路径是错的:

    {
     "display_name": "Python 2", 
     "language": "python", 
     "argv": [
      "C:\\ProgramData\\Anaconda3\\envs\\py2\\python.exe", 
      "-m", 
      "ipykernel_launcher", 
      "-f", 
      "{connection_file}"
     ]
    }

    我的Anaconda2安装的路径是C:\ProgramData\Anaconda2,其中的python.exe也在此根目录下,所以修改kernel.jason为:

    {
     "display_name": "Python 2", 
     "language": "python", 
     "argv": [
      "C:\\ProgramData\\Anaconda2\\python.exe", 
      "-m", 
      "ipykernel_launcher", 
      "-f", 
      "{connection_file}"
     ]
    }

    保存后重新打开jupyter notebook就不再显示kernel error了。


    注意有可能,你的Kernel还是显示的Kernel error,原因在于你选择的是python3内核,切换到python2就可以了(但如果你像我一样删除了Python3文件夹,jupyter notebook里是不会再显示python3内核的)。


    注:

    Anaconda2-4.1.1-Windows-x86_64.exe下载链接

    https://download.csdn.net/download/qq_21368481/10298381

    Anaconda3-5.1.0-Windows-x86_64.exe下载链接

    https://download.csdn.net/download/qq_21368481/10296836



    展开全文
  • 在Popupwindow布局中嵌套ScrollView,滑动内容时视图出现反复闪烁的问题
  • VS.NET安装时反复出现重启动的问题

    千次阅读 2006-05-01 19:31:00
    问题:在安装.NET第一步时,出现下面的提示:安装程序检测到另一个程序要求计算机重新启动.必须重新启动计算机后才能安装Visual.Studio.NET系统必备.系统重新启动后,你需重新启动安装程序.单击 确定 重新启动....
  • outlook反复出现验证

    千次阅读 2011-07-10 12:43:20
    user通过专线和公司内部exchange连接,(MAPI设置),第一次出现验证输入帐号密码和domain.但是过了一会还是出现验证界面,遮是为何,应该说第一次验证之后,除非关闭outlook,第二次登陆才让你输入帐号密码。 客户的...
  • 在使用电脑的过程中,可能会遇到这样一些问题: 桌面有流氓的“网址导航”快捷方式,删除后没多久又出现了。 某路径出现了占很大空间的文件夹,不知道谁创建的。 某个系统设置,修改后没...问题频繁出现的话,用Pr...
  • Adobe Acrobat DC卸载更新出现问题,重装更新显示找不到源而反复出现window installer 安装失败(开机弹窗,升级不了)解决方法,亲测有效!!! 某天电脑使用Adobe退出后想安装新版 安装突然出现这种情况 两天一直...
  • 小程序免不了有很多跳转的功能,但是跳转了多个页面后也会有一些问题,今天遇到个页面保存多个后,不会再跳转页面的问题; 首先; uni-app 给我们提供了多个跳转的方法: uni.navigateTo:保留当前页面,跳转到...
  • maven下载jar包, 反复出现lastUpdated文件

    千次阅读 多人点赞 2020-04-09 16:51:53
    如题, maven无法下载jar包, 并反复出现.lastUpdated结尾文件, 并且在build日志中, 显示 PKIX path building failed: sun.security.provider.certpath.SunCertPathBuilderException: unable to find valid ...
  • 于是在网上搜索,有个帖子说可能是jar引起的问题..   遂把WebContent/lib下的jar全部删除   重新拷贝   问题解决...   只是有点纳闷:两次都是在同一个地方拷贝的jar   怎么会出...
  • 计算机反复蓝屏问题--ntoskrnl.exe

    万次阅读 2019-11-01 15:24:22
    使用联想电脑管家分析问题 下载了蓝屏分析诊断工具,提取码:5dti 检测出来问题根源是ntoskrnl.exe 解决方案: ① 参考博客1 控制面板----管理工具----任务计划程序----找到.net framework项,四个都禁用...
  • 反复出现可转移问题,始终不能启动成功,此处问题出在BIOS设置,需要修改BIOS设置中如下项目 BIOS内把SATA通道改为IDE,路径如下:ICH Control Sub-Menu→Integrated Device Control Sub-Menu→SATA-Device 31, ...
  • ESP32 Camera ov2640反复重启问题

    千次阅读 2019-09-24 15:36:13
    ESP32 Camera ov2640反复重启问题 目前产品设计中,遇到了烧写玩代码后esp32反复重启,测试发现如果不接摄像头就不重启,所以判断和摄像头的使用有关,于是查找与摄像头有关的io发现,用了IO13和IO14两个管脚,这两...
  • 关于ESP8266反复启动问题的解决

    千次阅读 2019-04-02 10:23:39
    ESP8266刷不同固件后,有时会出现反复启动的问题,可能是FLASH里有未擦除干净的区域。 网上有很多清除方法,基本都是介绍在Python环境下擦除FLASH,对于菜鸟来说有点复杂。 无意中发现,乐鑫官网提供的FLASH工具...
  • 请修复AdobeFlashPlayer”,按照提示修复之后,却还是会反复出现这样的问题,该怎么办呢,接下来为大家讲述一下请修复adobe flash player 提示反复出现的最佳解决方法吧。具体步骤如下:1、按Windows+r键,打开...
  • ubuntu wifi 反复询问密码问题

    千次阅读 2013-12-08 20:50:34
    当ubuntu从待机状态,返回时,经常会出现反复询问输入网络密码问题。经过反复实验,发现问题原因在于wifi驱动。重新加载realtek的驱动即可。 脚本如下: #!/bin/sh echo start rm drivers sudo rmmod rtl8192ce ...
  • IDEA中Maven经常下载Jar包失败,反复出现LastUpdate文件的解决办法 这个问题一直困扰着我,直到我加了这样的参数后,这个问题迎刃而解! -Dmaven.wagon....
  • H5获取地理位置方法反复执行的问题

    千次阅读 2018-05-18 16:21:54
    最近用了下H5自带的地理位置获取的函数,但出现反复调用的问题。showPosition方法被反复执行,
  • ESP8266反复重启问题:Fatal exception 9

    千次阅读 2019-08-09 10:29:37
    ESP8266反复重启问题:Fatal exception 9: 根据打印信息,提示是字节对齐原因导致: 进一步定位到导致重启的代码是:spi_flash_read(Sector_VERIFY_INFO*4096,(uint32 *)&VerifyTest1, 32); 这个向flash读...
  • 3、更新成功之后反复更新 然后改了版本号码之后,先用命令安装官网的app,然后再用命令安装我自己修改的app,然后控制台没出现安装失败的提示,然后以为成功了,果断给客户集群服务器打补丁包,因为晚上1点多了,就...
  • 解决ubuntu反复登录的问题

    千次阅读 2016-03-09 10:29:26
    网上找了各种方法,出现这种现象的原因比较多,得挨个排查,现在把搜集到的解决方法列如下: 方案一: 如果是lightdm的登陆器问题,而且是不知名的问题,可以直接使用gdm登陆器来登陆。但是登陆后会需要修改相关...
  • 也就是常说的Mysql的8小时问题, Mysql服务器默认连接的“wait_timeout”是8小时,也就是说一个Connection空闲超过8个小时,Mysql将自动断开该 Connection。但是数据库连接池并不知道连接已经断开了,如果程序正巧...
  • 明天要演示,突然系统出现问题,页面反复登录不  Security-Kerberos
  • Unity中CharacterController.IsGrounded的值在True和False中反复出现导致跳跃键失灵的原因及解决方案 网上有很多用CharacterController实现游戏角色移动和跳跃的功能的代码,举个例子: public class ExampleClass :...
  • 解决BitLocker反复提示恢复密钥正确而无法进入系统的问题
  • 今天在安装matlab时候,遇到了一些问题,这里一并提出来: 首先是安装,这个很简单,之前写的一篇关于matlab2018安装的教程,这里借鉴里面的虚拟光驱问题。那篇博文链接:Matlab R2018a 中文版安装教程(同时适用于...
  • 这两天被这个问题搞的头痛, 查了很多方案,都没有解决这个问题 就是下面这个样子,点击关闭一会,又自动打开了。 网上查了很多解决方案,全部都没有解决问题 有说是windows的bug的, 有说要卸载office的 ...

空空如也

空空如也

1 2 3 4 5 ... 20
收藏数 212,682
精华内容 85,072
关键字:

对于反复出现的问题