精华内容
下载资源
问答
  • customs-rosm-frontend-源码

    2021-03-26 17:15:41
    sm --start CUSTOMS_ROSM_FRONTEND_ALL -f 停止所有正在运行的服务 sm --stop CUSTOMS_ROSM_FRONTEND_ALL 调试 在本地调试之前,您将需要停止服务管理器启动的海关ROSM前端 sm --stop CUSTOMS_ROSM_FRONTEND 然后在...
  • Invoke-customs are only supported starting with Android O (–min-api 26) Invoke-customs are only supported starting with Android O (--min-api 26) Stack trace: com.android.tools.r8.a: Invoke-customs ...

    android studio运行报错
    Invoke-customs are only supported starting with Android O (–min-api 26)

    Invoke-customs are only supported starting with Android O (--min-api 26)
    Stack trace:
    com.android.tools.r8.a: Invoke-customs are only supported starting with Android O (--min-api 26)
    	at com.android.tools.r8.dex.r.a(:291)
    	at com.android.tools.r8.dex.r.a(:98)
    	at com.android.tools.r8.dex.r.b(:188)
    	at com.android.tools.r8.dex.b.a(:63)
    	at com.google.common.util.concurrent.TrustedListenableFutureTask$TrustedFutureInterruptibleTask.runInterruptibly(TrustedListenableFutureTask.java:125)
    	at com.google.common.util.concurrent.InterruptibleTask.run(InterruptibleTask.java:69)
    	at com.google.common.util.concurrent.TrustedListenableFutureTask.run(TrustedListenableFutureTask.java:78)
    	at com.google.common.util.concurrent.MoreExecutors$DirectExecutorService.execute(MoreExecutors.java:322)
    	at java.util.concurrent.AbstractExecutorService.submit(AbstractExecutorService.java:134)
    	at com.google.common.util.concurrent.AbstractListeningExecutorService.submit(AbstractListeningExecutorService.java:66)
    	at com.google.common.util.concurrent.AbstractListeningExecutorService.submit(AbstractListeningExecutorService.java:36)
    	at com.android.tools.r8.dex.b.b(:46)
    	at com.android.tools.r8.D8.d(:92)
    	at com.android.tools.r8.D8.b(:1)
    	at com.android.tools.r8.utils.W.a(:30)
    	at com.android.tools.r8.D8.run(:11)
    	at com.android.builder.dexing.D8DexArchiveBuilder.convert(D8DexArchiveBuilder.java:116)
    	at com.android.build.gradle.internal.dependency.BaseDexingTransform.process(DexingTransform.kt:296)
    	at com.android.build.gradle.internal.dependency.BaseDexingTransform.processNonIncrementally(DexingTransform.kt:243)
    	at com.android.build.gradle.internal.dependency.BaseDexingTransform.doTransform(DexingTransform.kt:153)
    	at com.android.build.gradle.internal.dependency.BaseDexingTransform.access$doTransform(DexingTransform.kt:69)
    	at com.android.build.gradle.internal.dependency.BaseDexingTransform$transform$1.invoke(DexingTransform.kt:104)
    	at com.android.build.gradle.internal.dependency.BaseDexingTransform$transform$1.invoke(DexingTransform.kt:69)
    	at com.android.build.gradle.internal.tasks.BlocksUtilsKt.recordArtifactTransformSpan(BlocksUtils.kt:33)
    	at com.android.build.gradle.internal.dependency.BaseDexingTransform.transform(DexingTransform.kt:100)
    	at org.gradle.api.internal.artifacts.transform.DefaultTransformer.transform(DefaultTransformer.java:189)
    	at org.gradle.api.internal.artifacts.transform.DefaultTransformerInvocationFactory$TransformerExecution.execute(DefaultTransformerInvocationFactory.java:332)
    	at org.gradle.internal.execution.steps.ExecuteStep.lambda$execute$0(ExecuteStep.java:32)
    	at java.util.Optional.map(Optional.java:215)
    	at org.gradle.internal.execution.steps.ExecuteStep.execute(ExecuteStep.java:32)
    	at org.gradle.internal.execution.steps.ExecuteStep.execute(ExecuteStep.java:26)
    	at org.gradle.internal.execution.steps.CleanupOutputsStep.execute(CleanupOutputsStep.java:63)
    	at org.gradle.internal.execution.steps.CleanupOutputsStep.execute(CleanupOutputsStep.java:35)
    	at org.gradle.internal.execution.steps.ResolveInputChangesStep.execute(ResolveInputChangesStep.java:49)
    	at org.gradle.internal.execution.steps.ResolveInputChangesStep.execute(ResolveInputChangesStep.java:34)
    	at org.gradle.internal.execution.steps.CancelExecutionStep.execute(CancelExecutionStep.java:43)
    	at org.gradle.internal.execution.steps.TimeoutStep.executeWithoutTimeout(TimeoutStep.java:73)
    	at org.gradle.internal.execution.steps.TimeoutStep.execute(TimeoutStep.java:54)
    	at org.gradle.internal.execution.steps.CatchExceptionStep.execute(CatchExceptionStep.java:34)
    	at org.gradle.internal.execution.steps.CreateOutputsStep.execute(CreateOutputsStep.java:44)
    	at org.gradle.internal.execution.steps.SnapshotOutputsStep.execute(SnapshotOutputsStep.java:54)
    	at org.gradle.internal.execution.steps.SnapshotOutputsStep.execute(SnapshotOutputsStep.java:38)
    	at org.gradle.internal.execution.steps.BroadcastChangingOutputsStep.execute(BroadcastChangingOutputsStep.java:49)
    	at org.gradle.internal.execution.steps.CacheStep.executeWithoutCache(CacheStep.java:153)
    	at org.gradle.internal.execution.steps.CacheStep.execute(CacheStep.java:67)
    	at org.gradle.internal.execution.steps.CacheStep.execute(CacheStep.java:41)
    	at org.gradle.internal.execution.steps.StoreExecutionStateStep.execute(StoreExecutionStateStep.java:44)
    	at org.gradle.internal.execution.steps.StoreExecutionStateStep.execute(StoreExecutionStateStep.java:33)
    	at org.gradle.internal.execution.steps.RecordOutputsStep.execute(RecordOutputsStep.java:38)
    	at org.gradle.internal.execution.steps.RecordOutputsStep.execute(RecordOutputsStep.java:24)
    	at org.gradle.internal.execution.steps.SkipUpToDateStep.executeBecause(SkipUpToDateStep.java:92)
    	at org.gradle.internal.execution.steps.SkipUpToDateStep.lambda$execute$0(SkipUpToDateStep.java:85)
    	at java.util.Optional.map(Optional.java:215)
    	at org.gradle.internal.execution.steps.SkipUpToDateStep.execute(SkipUpToDateStep.java:55)
    	at org.gradle.internal.execution.steps.SkipUpToDateStep.execute(SkipUpToDateStep.java:39)
    	at org.gradle.internal.execution.steps.ResolveChangesStep.execute(ResolveChangesStep.java:76)
    	at org.gradle.internal.execution.steps.ResolveChangesStep.execute(ResolveChangesStep.java:37)
    	at org.gradle.internal.execution.steps.legacy.MarkSnapshottingInputsFinishedStep.execute(MarkSnapshottingInputsFinishedStep.java:36)
    	at org.gradle.internal.execution.steps.legacy.MarkSnapshottingInputsFinishedStep.execute(MarkSnapshottingInputsFinishedStep.java:26)
    	at org.gradle.internal.execution.steps.ResolveCachingStateStep.execute(ResolveCachingStateStep.java:94)
    	at org.gradle.internal.execution.steps.ResolveCachingStateStep.execute(ResolveCachingStateStep.java:49)
    	at org.gradle.internal.execution.steps.CaptureStateBeforeExecutionStep.execute(CaptureStateBeforeExecutionStep.java:79)
    	at org.gradle.internal.execution.steps.CaptureStateBeforeExecutionStep.execute(CaptureStateBeforeExecutionStep.java:53)
    	at org.gradle.internal.execution.steps.ValidateStep.execute(ValidateStep.java:74)
    	at org.gradle.internal.execution.steps.SkipEmptyWorkStep.lambda$execute$2(SkipEmptyWorkStep.java:78)
    	at java.util.Optional.orElseGet(Optional.java:267)
    	at org.gradle.internal.execution.steps.SkipEmptyWorkStep.execute(SkipEmptyWorkStep.java:78)
    	at org.gradle.internal.execution.steps.SkipEmptyWorkStep.execute(SkipEmptyWorkStep.java:34)
    	at org.gradle.internal.execution.steps.legacy.MarkSnapshottingInputsStartedStep.execute(MarkSnapshottingInputsStartedStep.java:39)
    	at org.gradle.internal.execution.steps.LoadExecutionStateStep.execute(LoadExecutionStateStep.java:40)
    	at org.gradle.internal.execution.steps.LoadExecutionStateStep.execute(LoadExecutionStateStep.java:28)
    	at org.gradle.internal.execution.impl.DefaultWorkExecutor.execute(DefaultWorkExecutor.java:33)
    	at org.gradle.api.internal.artifacts.transform.DefaultTransformerInvocationFactory$2.lambda$call$2(DefaultTransformerInvocationFactory.java:200)
    	at org.gradle.api.internal.artifacts.transform.DefaultTransformerInvocationFactory.fireTransformListeners(DefaultTransformerInvocationFactory.java:269)
    	at org.gradle.api.internal.artifacts.transform.DefaultTransformerInvocationFactory.access$300(DefaultTransformerInvocationFactory.java:79)
    	at org.gradle.api.internal.artifacts.transform.DefaultTransformerInvocationFactory$2.call(DefaultTransformerInvocationFactory.java:178)
    	at org.gradle.api.internal.artifacts.transform.DefaultTransformerInvocationFactory$2.call(DefaultTransformerInvocationFactory.java:175)
    	at org.gradle.internal.operations.DefaultBuildOperationExecutor$CallableBuildOperationWorker.execute(DefaultBuildOperationExecutor.java:416)
    	at org.gradle.internal.operations.DefaultBuildOperationExecutor$CallableBuildOperationWorker.execute(DefaultBuildOperationExecutor.java:406)
    	at org.gradle.internal.operations.DefaultBuildOperationExecutor$1.execute(DefaultBuildOperationExecutor.java:165)
    	at org.gradle.internal.operations.DefaultBuildOperationExecutor.execute(DefaultBuildOperationExecutor.java:250)
    	at org.gradle.internal.operations.DefaultBuildOperationExecutor.execute(DefaultBuildOperationExecutor.java:158)
    	at org.gradle.internal.operations.DefaultBuildOperationExecutor.call(DefaultBuildOperationExecutor.java:102)
    	at org.gradle.internal.operations.DelegatingBuildOperationExecutor.call(DelegatingBuildOperationExecutor.java:36)
    	at org.gradle.api.internal.artifacts.transform.DefaultTransformerInvocationFactory.lambda$doTransform$0(DefaultTransformerInvocationFactory.java:175)
    	at org.gradle.api.internal.artifacts.transform.ImmutableTransformationWorkspaceProvider.lambda$withWorkspace$0(ImmutableTransformationWorkspaceProvider.java:81)
    	at org.gradle.cache.internal.LockOnDemandCrossProcessCacheAccess.withFileLock(LockOnDemandCrossProcessCacheAccess.java:90)
    	at org.gradle.cache.internal.DefaultCacheAccess.withFileLock(DefaultCacheAccess.java:181)
    	at org.gradle.cache.internal.DefaultPersistentDirectoryStore.withFileLock(DefaultPersistentDirectoryStore.java:172)
    	at org.gradle.cache.internal.DefaultCacheFactory$ReferenceTrackingCache.withFileLock(DefaultCacheFactory.java:196)
    	at org.gradle.api.internal.artifacts.transform.ImmutableTransformationWorkspaceProvider.withWorkspace(ImmutableTransformationWorkspaceProvider.java:76)
    	at org.gradle.api.internal.artifacts.transform.AbstractCachingTransformationWorkspaceProvider.lambda$withWorkspace$0(AbstractCachingTransformationWorkspaceProvider.java:56)
    	at com.google.common.cache.LocalCache$LocalManualCache$1.load(LocalCache.java:4718)
    	at com.google.common.cache.LocalCache$LoadingValueReference.loadFuture(LocalCache.java:3445)
    	at com.google.common.cache.LocalCache$Segment.loadSync(LocalCache.java:2194)
    	at com.google.common.cache.LocalCache$Segment.lockedGetOrLoad(LocalCache.java:2153)
    	at com.google.common.cache.LocalCache$Segment.get(LocalCache.java:2043)
    	at com.google.common.cache.LocalCache.get(LocalCache.java:3851)
    	at com.google.common.cache.LocalCache$LocalManualCache.get(LocalCache.java:4713)
    	at org.gradle.api.internal.artifacts.transform.AbstractCachingTransformationWorkspaceProvider.withWorkspace(AbstractCachingTransformationWorkspaceProvider.java:55)
    	at org.gradle.api.internal.artifacts.transform.DefaultTransformerInvocationFactory.doTransform(DefaultTransformerInvocationFactory.java:175)
    	at org.gradle.api.internal.artifacts.transform.DefaultTransformerInvocationFactory.access$000(DefaultTransformerInvocationFactory.java:79)
    	at org.gradle.api.internal.artifacts.transform.DefaultTransformerInvocationFactory$1.invoke(DefaultTransformerInvocationFactory.java:141)
    	at org.gradle.api.internal.artifacts.transform.CacheableInvocation$1.invoke(CacheableInvocation.java:58)
    	at org.gradle.api.internal.artifacts.transform.TransformationNode$ChainedTransformationNode$1.lambda$transform$0(TransformationNode.java:226)
    	at org.gradle.internal.Try$Success.flatMap(Try.java:157)
    	at org.gradle.api.internal.artifacts.transform.TransformationNode$ChainedTransformationNode$1.transform(TransformationNode.java:225)
    	at org.gradle.api.internal.artifacts.transform.TransformationNode$ArtifactTransformationStepBuildOperation.call(TransformationNode.java:267)
    	at org.gradle.api.internal.artifacts.transform.TransformationNode$ArtifactTransformationStepBuildOperation.call(TransformationNode.java:247)
    	at org.gradle.internal.operations.DefaultBuildOperationExecutor$CallableBuildOperationWorker.execute(DefaultBuildOperationExecutor.java:416)
    	at org.gradle.internal.operations.DefaultBuildOperationExecutor$CallableBuildOperationWorker.execute(DefaultBuildOperationExecutor.java:406)
    	at org.gradle.internal.operations.DefaultBuildOperationExecutor$1.execute(DefaultBuildOperationExecutor.java:165)
    	at org.gradle.internal.operations.DefaultBuildOperationExecutor.execute(DefaultBuildOperationExecutor.java:250)
    	at org.gradle.internal.operations.DefaultBuildOperationExecutor.execute(DefaultBuildOperationExecutor.java:158)
    	at org.gradle.internal.operations.DefaultBuildOperationExecutor.call(DefaultBuildOperationExecutor.java:102)
    	at org.gradle.internal.operations.DelegatingBuildOperationExecutor.call(DelegatingBuildOperationExecutor.java:36)
    	at org.gradle.api.internal.artifacts.transform.TransformationNode$ChainedTransformationNode.execute(TransformationNode.java:222)
    	at org.gradle.execution.plan.WorkNodeExecutor.execute(WorkNodeExecutor.java:27)
    	at org.gradle.execution.taskgraph.DefaultTaskExecutionGraph$InvokeNodeExecutorsAction.execute(DefaultTaskExecutionGraph.java:372)
    	at org.gradle.execution.taskgraph.DefaultTaskExecutionGraph$InvokeNodeExecutorsAction.execute(DefaultTaskExecutionGraph.java:359)
    	at org.gradle.execution.taskgraph.DefaultTaskExecutionGraph$BuildOperationAwareExecutionAction.execute(DefaultTaskExecutionGraph.java:352)
    	at org.gradle.execution.taskgraph.DefaultTaskExecutionGraph$BuildOperationAwareExecutionAction.execute(DefaultTaskExecutionGraph.java:338)
    	at org.gradle.execution.plan.DefaultPlanExecutor$ExecutorWorker.lambda$run$0(DefaultPlanExecutor.java:127)
    	at org.gradle.execution.plan.DefaultPlanExecutor$ExecutorWorker.execute(DefaultPlanExecutor.java:191)
    	at org.gradle.execution.plan.DefaultPlanExecutor$ExecutorWorker.executeNextNode(DefaultPlanExecutor.java:182)
    	at org.gradle.execution.plan.DefaultPlanExecutor$ExecutorWorker.run(DefaultPlanExecutor.java:124)
    	at org.gradle.internal.concurrent.ExecutorPolicy$CatchAndRecordFailures.onExecute(ExecutorPolicy.java:64)
    	at org.gradle.internal.concurrent.ManagedExecutorImpl$1.run(ManagedExecutorImpl.java:48)
    	at java.util.concurrent.ThreadPoolExecutor.runWorker(ThreadPoolExecutor.java:1149)
    	at java.util.concurrent.ThreadPoolExecutor$Worker.run(ThreadPoolExecutor.java:624)
    	at org.gradle.internal.concurrent.ThreadFactoryImpl$ManagedThreadRunnable.run(ThreadFactoryImpl.java:56)
    	at java.lang.Thread.run(Thread.java:748)
    	Suppressed: java.util.concurrent.ExecutionException: com.android.tools.r8.a: Invoke-customs are only supported starting with Android O (--min-api 26)
    		at com.google.common.util.concurrent.AbstractFuture.getDoneValue(AbstractFuture.java:552)
    		at com.google.common.util.concurrent.AbstractFuture.get(AbstractFuture.java:513)
    		at com.google.common.util.concurrent.FluentFuture$TrustedFuture.get(FluentFuture.java:86)
    		at com.android.tools.r8.utils.U0.a(:14)
    		at com.android.tools.r8.dex.b.b(:101)
    		... 120 more
    	[CIRCULAR REFERENCE:com.android.tools.r8.a: Invoke-customs are only supported starting with Android O (--min-api 26)]
    
    
    
    compileOptions {
            sourceCompatibility JavaVersion.VERSION_1_8
            targetCompatibility JavaVersion.VERSION_1_8
        }
    

    将代码添加到app的build.gradle的android节点下

    在这里插入图片描述

    参考:
    https://blog.csdn.net/csdn9228/article/details/90905430
    https://blog.csdn.net/luckyion/article/details/105395902

    展开全文
  • SAR6 Customs Bot或SAR6C是基于Python的Discord机器人,用于为SA-R6社区Discord Server进行Customs或“ Pug”风格的比赛。该机器人会注册用户,执行配对活动并跟踪玩家得分。该机器人当前的版本为0.1,因为尚未添加...
  • American wedding customs

    2011-05-05 21:50:50
    This ppt gives information about American wedding customs, mainly about engagement, wedding ceremony, wedding vows, etc
  • at sun.reflect.NativeConstructorAccessorImpl.newInstance0(Native Method) ... Suppressed: com.android.tools.r8.ApiLevelException: Invoke-customs are only supported starting with Android O (--min-...
    com.android.builder.dexing.DexArchiveBuilderException: com.android.builder.dexing.DexArchiveBuilderException: Failed to process /Users/Project/GitLab/rsdk-client-plugin-android/Android/Plugins/AndroidStudio/sq37gameshskd/riversdk_core_libs/libs/okhttp-3.14.2.jar
    	at sun.reflect.NativeConstructorAccessorImpl.newInstance0(Native Method)
    	at sun.reflect.NativeConstructorAccessorImpl.newInstance(NativeConstructorAccessorImpl.java:62)
    	at sun.reflect.DelegatingConstructorAccessorImpl.newInstance(DelegatingConstructorAccessorImpl.java:45)
    	at java.lang.reflect.Constructor.newInstance(Constructor.java:423)
    	at java.util.concurrent.ForkJoinTask.getThrowableException(ForkJoinTask.java:593)
    	at java.util.concurrent.ForkJoinTask.reportException(ForkJoinTask.java:677)
    	at java.util.concurrent.ForkJoinTask.join(ForkJoinTask.java:720)
    	at com.android.ide.common.internal.WaitableExecutor.waitForTasksWithQuickFail(WaitableExecutor.java:146)
    	at com.android.build.gradle.internal.transforms.DexArchiveBuilderTransform.transform(DexArchiveBuilderTransform.java:308)
    	at com.android.build.gradle.internal.pipeline.TransformTask$2.call(TransformTask.java:221)
    	at com.android.build.gradle.internal.pipeline.TransformTask$2.call(TransformTask.java:217)
    	at com.android.builder.profile.ThreadRecorder.record(ThreadRecorder.java:102)
    	at com.android.build.gradle.internal.pipeline.TransformTask.transform(TransformTask.java:212)
    	at sun.reflect.NativeMethodAccessorImpl.invoke0(Native Method)
    	at sun.reflect.NativeMethodAccessorImpl.invoke(NativeMethodAccessorImpl.java:62)
    	at sun.reflect.DelegatingMethodAccessorImpl.invoke(DelegatingMethodAccessorImpl.java:43)
    	at java.lang.reflect.Method.invoke(Method.java:498)
    	at org.gradle.internal.reflect.JavaMethod.invoke(JavaMethod.java:73)
    	at org.gradle.api.internal.project.taskfactory.IncrementalTaskAction.doExecute(IncrementalTaskAction.java:46)
    	at org.gradle.api.internal.project.taskfactory.StandardTaskAction.execute(StandardTaskAction.java:39)
    	at org.gradle.api.internal.project.taskfactory.StandardTaskAction.execute(StandardTaskAction.java:26)
    	at org.gradle.api.internal.tasks.execution.ExecuteActionsTaskExecuter$1.run(ExecuteActionsTaskExecuter.java:121)
    	at org.gradle.internal.progress.DefaultBuildOperationExecutor$RunnableBuildOperationWorker.execute(DefaultBuildOperationExecutor.java:336)
    	at org.gradle.internal.progress.DefaultBuildOperationExecutor$RunnableBuildOperationWorker.execute(DefaultBuildOperationExecutor.java:328)
    	at org.gradle.internal.progress.DefaultBuildOperationExecutor.execute(DefaultBuildOperationExecutor.java:199)
    	at org.gradle.internal.progress.DefaultBuildOperationExecutor.run(DefaultBuildOperationExecutor.java:110)
    	at org.gradle.api.internal.tasks.execution.ExecuteActionsTaskExecuter.executeAction(ExecuteActionsTaskExecuter.java:110)
    	at org.gradle.api.internal.tasks.execution.ExecuteActionsTaskExecuter.executeActions(ExecuteActionsTaskExecuter.java:92)
    	at org.gradle.api.internal.tasks.execution.ExecuteActionsTaskExecuter.execute(ExecuteActionsTaskExecuter.java:70)
    	at org.gradle.api.internal.tasks.execution.OutputDirectoryCreatingTaskExecuter.execute(OutputDirectoryCreatingTaskExecuter.java:51)
    	at org.gradle.api.internal.tasks.execution.SkipUpToDateTaskExecuter.execute(SkipUpToDateTaskExecuter.java:62)
    	at org.gradle.api.internal.tasks.execution.ResolveTaskOutputCachingStateExecuter.execute(ResolveTaskOutputCachingStateExecuter.java:54)
    	at org.gradle.api.internal.tasks.execution.ValidatingTaskExecuter.execute(ValidatingTaskExecuter.java:60)
    	at org.gradle.api.internal.tasks.execution.SkipEmptySourceFilesTaskExecuter.execute(SkipEmptySourceFilesTaskExecuter.java:97)
    	at org.gradle.api.internal.tasks.execution.CleanupStaleOutputsExecuter.execute(CleanupStaleOutputsExecuter.java:87)
    	at org.gradle.api.internal.tasks.execution.ResolveTaskArtifactStateTaskExecuter.execute(ResolveTaskArtifactStateTaskExecuter.java:52)
    	at org.gradle.api.internal.tasks.execution.SkipTaskWithNoActionsExecuter.execute(SkipTaskWithNoActionsExecuter.java:52)
    	at org.gradle.api.internal.tasks.execution.SkipOnlyIfTaskExecuter.execute(SkipOnlyIfTaskExecuter.java:54)
    	at org.gradle.api.internal.tasks.execution.ExecuteAtMostOnceTaskExecuter.execute(ExecuteAtMostOnceTaskExecuter.java:43)
    	at org.gradle.api.internal.tasks.execution.CatchExceptionTaskExecuter.execute(CatchExceptionTaskExecuter.java:34)
    	at org.gradle.execution.taskgraph.DefaultTaskGraphExecuter$EventFiringTaskWorker$1.run(DefaultTaskGraphExecuter.java:248)
    	at org.gradle.internal.progress.DefaultBuildOperationExecutor$RunnableBuildOperationWorker.execute(DefaultBuildOperationExecutor.java:336)
    	at org.gradle.internal.progress.DefaultBuildOperationExecutor$RunnableBuildOperationWorker.execute(DefaultBuildOperationExecutor.java:328)
    	at org.gradle.internal.progress.DefaultBuildOperationExecutor.execute(DefaultBuildOperationExecutor.java:199)
    	at org.gradle.internal.progress.DefaultBuildOperationExecutor.run(DefaultBuildOperationExecutor.java:110)
    	at org.gradle.execution.taskgraph.DefaultTaskGraphExecuter$EventFiringTaskWorker.execute(DefaultTaskGraphExecuter.java:241)
    	at org.gradle.execution.taskgraph.DefaultTaskGraphExecuter$EventFiringTaskWorker.execute(DefaultTaskGraphExecuter.java:230)
    	at org.gradle.execution.taskgraph.DefaultTaskPlanExecutor$TaskExecutorWorker.processTask(DefaultTaskPlanExecutor.java:123)
    	at org.gradle.execution.taskgraph.DefaultTaskPlanExecutor$TaskExecutorWorker.access$200(DefaultTaskPlanExecutor.java:79)
    	at org.gradle.execution.taskgraph.DefaultTaskPlanExecutor$TaskExecutorWorker$1.execute(DefaultTaskPlanExecutor.java:104)
    	at org.gradle.execution.taskgraph.DefaultTaskPlanExecutor$TaskExecutorWorker$1.execute(DefaultTaskPlanExecutor.java:98)
    	at org.gradle.execution.taskgraph.DefaultTaskExecutionPlan.execute(DefaultTaskExecutionPlan.java:626)
    	at org.gradle.execution.taskgraph.DefaultTaskExecutionPlan.executeWithTask(DefaultTaskExecutionPlan.java:581)
    	at org.gradle.execution.taskgraph.DefaultTaskPlanExecutor$TaskExecutorWorker.run(DefaultTaskPlanExecutor.java:98)
    	at org.gradle.execution.taskgraph.DefaultTaskPlanExecutor.process(DefaultTaskPlanExecutor.java:59)
    	at org.gradle.execution.taskgraph.DefaultTaskGraphExecuter.execute(DefaultTaskGraphExecuter.java:128)
    	at org.gradle.execution.SelectedTaskExecutionAction.execute(SelectedTaskExecutionAction.java:37)
    	at org.gradle.execution.DefaultBuildExecuter.execute(DefaultBuildExecuter.java:37)
    	at org.gradle.execution.DefaultBuildExecuter.access$000(DefaultBuildExecuter.java:23)
    	at org.gradle.execution.DefaultBuildExecuter$1.proceed(DefaultBuildExecuter.java:43)
    	at org.gradle.execution.DryRunBuildExecutionAction.execute(DryRunBuildExecutionAction.java:46)
    	at org.gradle.execution.DefaultBuildExecuter.execute(DefaultBuildExecuter.java:37)
    	at org.gradle.execution.DefaultBuildExecuter.execute(DefaultBuildExecuter.java:30)
    	at org.gradle.initialization.DefaultGradleLauncher$ExecuteTasks.run(DefaultGradleLauncher.java:314)
    	at org.gradle.internal.progress.DefaultBuildOperationExecutor$RunnableBuildOperationWorker.execute(DefaultBuildOperationExecutor.java:336)
    	at org.gradle.internal.progress.DefaultBuildOperationExecutor$RunnableBuildOperationWorker.execute(DefaultBuildOperationExecutor.java:328)
    	at org.gradle.internal.progress.DefaultBuildOperationExecutor.execute(DefaultBuildOperationExecutor.java:199)
    	at org.gradle.internal.progress.DefaultBuildOperationExecutor.run(DefaultBuildOperationExecutor.java:110)
    	at org.gradle.initialization.DefaultGradleLauncher.runTasks(DefaultGradleLauncher.java:204)
    	at org.gradle.initialization.DefaultGradleLauncher.doBuildStages(DefaultGradleLauncher.java:134)
    	at org.gradle.initialization.DefaultGradleLauncher.executeTasks(DefaultGradleLauncher.java:109)
    	at org.gradle.internal.invocation.GradleBuildController$1.call(GradleBuildController.java:78)
    	at org.gradle.internal.invocation.GradleBuildController$1.call(GradleBuildController.java:75)
    	at org.gradle.internal.work.DefaultWorkerLeaseService.withLocks(DefaultWorkerLeaseService.java:152)
    	at org.gradle.internal.invocation.GradleBuildController.doBuild(GradleBuildController.java:100)
    	at org.gradle.internal.invocation.GradleBuildController.run(GradleBuildController.java:75)
    	at org.gradle.tooling.internal.provider.runner.BuildModelActionRunner.run(BuildModelActionRunner.java:53)
    	at org.gradle.launcher.exec.ChainingBuildActionRunner.run(ChainingBuildActionRunner.java:35)
    	at org.gradle.launcher.exec.ChainingBuildActionRunner.run(ChainingBuildActionRunner.java:35)
    	at org.gradle.tooling.internal.provider.ValidatingBuildActionRunner.run(ValidatingBuildActionRunner.java:32)
    	at org.gradle.launcher.exec.RunAsBuildOperationBuildActionRunner$1.run(RunAsBuildOperationBuildActionRunner.java:43)
    	at org.gradle.internal.progress.DefaultBuildOperationExecutor$RunnableBuildOperationWorker.execute(DefaultBuildOperationExecutor.java:336)
    	at org.gradle.internal.progress.DefaultBuildOperationExecutor$RunnableBuildOperationWorker.execute(DefaultBuildOperationExecutor.java:328)
    	at org.gradle.internal.progress.DefaultBuildOperationExecutor.execute(DefaultBuildOperationExecutor.java:199)
    	at org.gradle.internal.progress.DefaultBuildOperationExecutor.run(DefaultBuildOperationExecutor.java:110)
    	at org.gradle.launcher.exec.RunAsBuildOperationBuildActionRunner.run(RunAsBuildOperationBuildActionRunner.java:40)
    	at org.gradle.tooling.internal.provider.SubscribableBuildActionRunner.run(SubscribableBuildActionRunner.java:51)
    	at org.gradle.launcher.exec.InProcessBuildActionExecuter.execute(InProcessBuildActionExecuter.java:47)
    	at org.gradle.launcher.exec.InProcessBuildActionExecuter.execute(InProcessBuildActionExecuter.java:30)
    	at org.gradle.launcher.exec.BuildTreeScopeBuildActionExecuter.execute(BuildTreeScopeBuildActionExecuter.java:39)
    	at org.gradle.launcher.exec.BuildTreeScopeBuildActionExecuter.execute(BuildTreeScopeBuildActionExecuter.java:25)
    	at org.gradle.tooling.internal.provider.ContinuousBuildActionExecuter.execute(ContinuousBuildActionExecuter.java:80)
    	at org.gradle.tooling.internal.provider.ContinuousBuildActionExecuter.execute(ContinuousBuildActionExecuter.java:53)
    	at org.gradle.tooling.internal.provider.ServicesSetupBuildActionExecuter.execute(ServicesSetupBuildActionExecuter.java:57)
    	at org.gradle.tooling.internal.provider.ServicesSetupBuildActionExecuter.execute(ServicesSetupBuildActionExecuter.java:32)
    	at org.gradle.tooling.internal.provider.GradleThreadBuildActionExecuter.execute(GradleThreadBuildActionExecuter.java:36)
    	at org.gradle.tooling.internal.provider.GradleThreadBuildActionExecuter.execute(GradleThreadBuildActionExecuter.java:25)
    	at org.gradle.tooling.internal.provider.ParallelismConfigurationBuildActionExecuter.execute(ParallelismConfigurationBuildActionExecuter.java:43)
    	at org.gradle.tooling.internal.provider.ParallelismConfigurationBuildActionExecuter.execute(ParallelismConfigurationBuildActionExecuter.java:29)
    	at org.gradle.tooling.internal.provider.StartParamsValidatingActionExecuter.execute(StartParamsValidatingActionExecuter.java:69)
    	at org.gradle.tooling.internal.provider.StartParamsValidatingActionExecuter.execute(StartParamsValidatingActionExecuter.java:30)
    	at org.gradle.tooling.internal.provider.SessionFailureReportingActionExecuter.execute(SessionFailureReportingActionExecuter.java:59)
    	at org.gradle.tooling.internal.provider.SessionFailureReportingActionExecuter.execute(SessionFailureReportingActionExecuter.java:44)
    	at org.gradle.tooling.internal.provider.SetupLoggingActionExecuter.execute(SetupLoggingActionExecuter.java:45)
    	at org.gradle.tooling.internal.provider.SetupLoggingActionExecuter.execute(SetupLoggingActionExecuter.java:30)
    	at org.gradle.launcher.daemon.server.exec.ExecuteBuild.doBuild(ExecuteBuild.java:67)
    	at org.gradle.launcher.daemon.server.exec.BuildCommandOnly.execute(BuildCommandOnly.java:36)
    	at org.gradle.launcher.daemon.server.api.DaemonCommandExecution.proceed(DaemonCommandExecution.java:122)
    	at org.gradle.launcher.daemon.server.exec.WatchForDisconnection.execute(WatchForDisconnection.java:37)
    	at org.gradle.launcher.daemon.server.api.DaemonCommandExecution.proceed(DaemonCommandExecution.java:122)
    	at org.gradle.launcher.daemon.server.exec.ResetDeprecationLogger.execute(ResetDeprecationLogger.java:26)
    	at org.gradle.launcher.daemon.server.api.DaemonCommandExecution.proceed(DaemonCommandExecution.java:122)
    	at org.gradle.launcher.daemon.server.exec.RequestStopIfSingleUsedDaemon.execute(RequestStopIfSingleUsedDaemon.java:34)
    	at org.gradle.launcher.daemon.server.api.DaemonCommandExecution.proceed(DaemonCommandExecution.java:122)
    	at org.gradle.launcher.daemon.server.exec.ForwardClientInput$2.call(ForwardClientInput.java:74)
    	at org.gradle.launcher.daemon.server.exec.ForwardClientInput$2.call(ForwardClientInput.java:72)
    	at org.gradle.util.Swapper.swap(Swapper.java:38)
    	at org.gradle.launcher.daemon.server.exec.ForwardClientInput.execute(ForwardClientInput.java:72)
    	at org.gradle.launcher.daemon.server.api.DaemonCommandExecution.proceed(DaemonCommandExecution.java:122)
    	at org.gradle.launcher.daemon.server.exec.LogAndCheckHealth.execute(LogAndCheckHealth.java:55)
    	at org.gradle.launcher.daemon.server.api.DaemonCommandExecution.proceed(DaemonCommandExecution.java:122)
    	at org.gradle.launcher.daemon.server.exec.LogToClient.doBuild(LogToClient.java:62)
    	at org.gradle.launcher.daemon.server.exec.BuildCommandOnly.execute(BuildCommandOnly.java:36)
    	at org.gradle.launcher.daemon.server.api.DaemonCommandExecution.proceed(DaemonCommandExecution.java:122)
    	at org.gradle.launcher.daemon.server.exec.EstablishBuildEnvironment.doBuild(EstablishBuildEnvironment.java:82)
    	at org.gradle.launcher.daemon.server.exec.BuildCommandOnly.execute(BuildCommandOnly.java:36)
    	at org.gradle.launcher.daemon.server.api.DaemonCommandExecution.proceed(DaemonCommandExecution.java:122)
    	at org.gradle.launcher.daemon.server.exec.StartBuildOrRespondWithBusy$1.run(StartBuildOrRespondWithBusy.java:50)
    	at org.gradle.launcher.daemon.server.DaemonStateCoordinator$1.run(DaemonStateCoordinator.java:295)
    	at org.gradle.internal.concurrent.ExecutorPolicy$CatchAndRecordFailures.onExecute(ExecutorPolicy.java:63)
    	at org.gradle.internal.concurrent.ManagedExecutorImpl$1.run(ManagedExecutorImpl.java:46)
    	at java.util.concurrent.ThreadPoolExecutor.runWorker(ThreadPoolExecutor.java:1149)
    	at java.util.concurrent.ThreadPoolExecutor$Worker.run(ThreadPoolExecutor.java:624)
    	at org.gradle.internal.concurrent.ThreadFactoryImpl$ManagedThreadRunnable.run(ThreadFactoryImpl.java:55)
    	at java.lang.Thread.run(Thread.java:748)
    Caused by: com.android.builder.dexing.DexArchiveBuilderException: Failed to process /Users/Project/GitLab/rsdk-client-plugin-android/Android/Plugins/AndroidStudio/sq37gameshskd/riversdk_core_libs/libs/okhttp-3.14.2.jar
    	at com.android.build.gradle.internal.transforms.DexArchiveBuilderTransform.launchProcessing(DexArchiveBuilderTransform.java:805)
    	at com.android.build.gradle.internal.transforms.DexArchiveBuilderTransform.lambda$convertToDexArchive$8(DexArchiveBuilderTransform.java:730)
    	at java.util.concurrent.ForkJoinTask$AdaptedCallable.exec(ForkJoinTask.java:1424)
    	at java.util.concurrent.ForkJoinTask.doExec(ForkJoinTask.java:289)
    	at java.util.concurrent.ForkJoinPool$WorkQueue.runTask(ForkJoinPool.java:1056)
    	at java.util.concurrent.ForkJoinPool.runWorker(ForkJoinPool.java:1692)
    	at java.util.concurrent.ForkJoinWorkerThread.run(ForkJoinWorkerThread.java:157)
    Caused by: com.android.builder.dexing.DexArchiveBuilderException: Error while dexing.
    The dependency contains Java 8 bytecode. Please enable desugaring by adding the following to build.gradle
    android {
        compileOptions {
            sourceCompatibility 1.8
            targetCompatibility 1.8
        }
    }
    See https://developer.android.com/studio/write/java8-support.html for details. Alternatively, increase the minSdkVersion to 26 or above.
    
    	at com.android.builder.dexing.D8DexArchiveBuilder.getExceptionToRethrow(D8DexArchiveBuilder.java:175)
    	at com.android.builder.dexing.D8DexArchiveBuilder.convert(D8DexArchiveBuilder.java:152)
    	at com.android.build.gradle.internal.transforms.DexArchiveBuilderTransform.launchProcessing(DexArchiveBuilderTransform.java:800)
    	... 6 more
    Caused by: com.android.tools.r8.CompilationFailedException: Compilation failed to complete
    	at com.android.tools.r8.utils.ExceptionUtils.withCompilationHandler(ExceptionUtils.java:76)
    	at com.android.tools.r8.utils.ExceptionUtils.withD8CompilationHandler(ExceptionUtils.java:45)
    	at com.android.tools.r8.D8.run(D8.java:88)
    	at com.android.builder.dexing.D8DexArchiveBuilder.convert(D8DexArchiveBuilder.java:147)
    	... 7 more
    Caused by: com.android.tools.r8.utils.AbortException
    	at com.android.tools.r8.utils.Reporter.failIfPendingErrors(Reporter.java:77)
    	at com.android.tools.r8.utils.Reporter.fatalError(Reporter.java:67)
    	at com.android.tools.r8.utils.ExceptionUtils.withCompilationHandler(ExceptionUtils.java:62)
    	... 10 more
    	Suppressed: com.android.tools.r8.ApiLevelException: Invoke-customs are only supported starting with Android O (--min-api 26)
    		at com.android.tools.r8.dex.FileWriter.checkThatInvokeCustomIsAllowed(FileWriter.java:1296)
    		at com.android.tools.r8.dex.FileWriter.writeCallSite(FileWriter.java:635)
    		at com.android.tools.r8.dex.FileWriter.writeFixedSectionItems(FileWriter.java:302)
    		at com.android.tools.r8.dex.FileWriter.generate(FileWriter.java:193)
    		at com.android.tools.r8.dex.ApplicationWriter.writeDexFile(ApplicationWriter.java:356)
    		at com.android.tools.r8.dex.ApplicationWriter.lambda$write$2(ApplicationWriter.java:188)
    		at java.util.concurrent.FutureTask.run(FutureTask.java:266)
    		at java.util.concurrent.ThreadPoolExecutor.runWorker(ThreadPoolExecutor.java:1149)
    		at java.util.concurrent.ThreadPoolExecutor$Worker.run(ThreadPoolExecutor.java:624)
    		at java.lang.Thread.run(Thread.java:748)
    		Suppressed: java.util.concurrent.ExecutionException: com.android.tools.r8.ApiLevelException: Invoke-customs are only supported starting with Android O (--min-api 26)
    			at java.util.concurrent.FutureTask.report(FutureTask.java:122)
    			at java.util.concurrent.FutureTask.get(FutureTask.java:192)
    			at com.android.tools.r8.utils.ThreadUtils.awaitFutures(ThreadUtils.java:21)
    			at com.android.tools.r8.dex.ApplicationWriter.write(ApplicationWriter.java:216)
    			at com.android.tools.r8.D8.run(D8.java:167)
    			at com.android.tools.r8.D8.lambda$run$1(D8.java:91)
    			at com.android.tools.r8.utils.ExceptionUtils.withCompilationHandler(ExceptionUtils.java:58)
    			at com.android.tools.r8.utils.ExceptionUtils.withD8CompilationHandler(ExceptionUtils.java:45)
    			at com.android.tools.r8.D8.run(D8.java:88)
    			at com.android.builder.dexing.D8DexArchiveBuilder.convert(D8DexArchiveBuilder.java:147)
    			at com.android.build.gradle.internal.transforms.DexArchiveBuilderTransform.launchProcessing(DexArchiveBuilderTransform.java:800)
    			at com.android.build.gradle.internal.transforms.DexArchiveBuilderTransform.lambda$convertToDexArchive$8(DexArchiveBuilderTransform.java:730)
    			at java.util.concurrent.ForkJoinTask$AdaptedCallable.exec(ForkJoinTask.java:1424)
    			at java.util.concurrent.ForkJoinTask.doExec(ForkJoinTask.java:289)
    			at java.util.concurrent.ForkJoinPool$WorkQueue.runTask(ForkJoinPool.java:1056)
    			at java.util.concurrent.ForkJoinPool.runWorker(ForkJoinPool.java:1692)
    			at java.util.concurrent.ForkJoinWorkerThread.run(ForkJoinWorkerThread.java:157)
    	[CIRCULAR REFERENCE:com.android.tools.r8.ApiLevelException: Invoke-customs are only supported starting with Android O (--min-api 26)]
    
    :app:transformClassesWithDexBuilderForRelease FAILED
    
    FAILURE: Build failed with an exception.
    
    * What went wrong:
    Execution failed for task ':app:transformClassesWithDexBuilderForRelease'.
    

    使用:Caused by: com.android.builder.dexing.DexArchiveBuilderException: Error while dexing.
    The dependency contains Java 8 bytecode. Please enable desugaring by adding the following to build.gradle
    android {
    compileOptions {
    sourceCompatibility 1.8
    targetCompatibility 1.8
    }
    }

    展开全文
  • customs英语海关实用PPT课件.pptx
  • om.android.tools.r8.a: Invoke-customs are only supported starting with Android O (--min-api 26) at com.android.tools.r8.dex.r.a(:291) at com.android.tools.r8.dex.r.a(:98) at ...

    最近在开发当中遇到了一个编译失败的错误,记录一下。

    错误片段

    om.android.tools.r8.a: Invoke-customs are only supported starting with Android O (--min-api 26)
    	at com.android.tools.r8.dex.r.a(:291)
    	at com.android.tools.r8.dex.r.a(:98)
    	at com.android.tools.r8.dex.r.b(:188)
    	at com.android.tools.r8.dex.b.a(:63)
    	at com.google.common.util.concurrent.TrustedListenableFutureTask$TrustedFutureInterruptibleTask.runInterruptibly(TrustedListenableFutureTask.java:125)
    	at com.google.common.util.concurrent.InterruptibleTask.run(InterruptibleTask.java:69)
    	at com.google.common.util.concurrent.TrustedListenableFutureTask.run(TrustedListenableFutureTask.java:78)
    	at com.google.common.util.concurrent.MoreExecutors$DirectExecutorService.execute(MoreExecutors.java:322)
    	at java.util.concurrent.AbstractExecutorService.submit(AbstractExecutorService.java:134)
    	at com.google.common.util.concurrent.AbstractListeningExecutorService.submit(AbstractListeningExecutorService.java:66)
    	at com.google.common.util.concurrent.AbstractListeningExecutorService.submit(AbstractListeningExecutorService.java:36)
    	at com.android.tools.r8.dex.b.b(:46)
    	at com.android.tools.r8.D8.d(:92)
    	at com.android.tools.r8.D8.b(:1)
    	at com.android.tools.r8.utils.W.a(:30)
    	at com.android.tools.r8.D8.run(:11)
    	....
    

    修正错误方法

    在运行的app的build.gradle文件当中加入下面语句

    android{
    	compileOptions {
            sourceCompatibility JavaVersion.VERSION_1_8
            targetCompatibility JavaVersion.VERSION_1_8
        }
    }
    

    这是由于之前加入某个依赖,必须支持Java导致的错误。

    展开全文
  • Customs 海关申报系统
  • dl-customs-report-源码

    2021-04-08 12:49:35
    dl-custom-report
  • tabGroup_customs-crx插件

    2021-04-05 04:39:31
    语言:日本語 选项卡组函数扩展。 选项卡组函数扩展。 ■当前功能 •单击选项卡时,所有其他选项卡组关闭。 即使我把它放在标签组中,我也可以避免标签打开的情况,它是累积的。 ■未来的职能预约计划 ·保存选项...
  • Invoke-customs are only supported starting with Android O (--min-api 26) 解决方法: 在module的build.gradle里面增加Java编译版本控制: android { ...... compileOptions { sourceC...

    Android报错:

    Invoke-customs are only supported starting with Android O (--min-api 26)

     

     

    解决方法:

    在module的build.gradle里面增加Java编译版本控制:

    android {
        ......
        
        compileOptions {
            sourceCompatibility JavaVersion.VERSION_1_8
            targetCompatibility JavaVersion.VERSION_1_8
        }
    }

     

    展开全文
  • customs and human resource

    2019-04-01 01:15:33
    NULL 博文链接:https://bingxuecai.iteye.com/blog/1409248
  • 海关申报出口前端 声明导出前端应用程序。 开发人员注意事项 您可能要指向非本地前端资产服务器。 如果是这样,则只需设置环境变量ASSETS_URL 执照 此代码是根据Apache 2.0许可获得许可的开源软件 ...
  • Customs-Clearance-master:顾客评论
  • android studio 报错Invoke-customs are only supported starting with Android O (–min-api 26) 解决方法: 在build.gradle中android下,增加如下代码:
  • 产生背景: 更改了BuildToolsVersion,或者添加的依赖版本有问题。 解决方法: 在build.gradle(app那个)内添加如图所示代码 代码如下: compileOptions { sourceCompatibility JavaVersion.VERSION_1_8 ...
  • IPython习俗 ipython笔记本的定制。 当与Jupyter笔记本一起使用时,它可以将文件保存在〜/ .ipython / profile_default / static / custom中
  • 我当时是能够编译通过,所以就没想gradle的事,最后果然还是gradle里的问题,在android节点下的compileOptions节点没有添加,加上接着就好了。 compileOptions { sourceCompatibility JavaVersion.VERSION_1_8 ...
  • 问题的原因: 我出现这个问题的原因是targetSdkVersion低于buildToolsVersion,如图: 解决方法: 在app.gradle中添加如下代码,添加的位置如图: compileOptions { sourceCompatibility JavaVersion.VERSION_1_8...
  • 在APP设置中添加了AndroidX的PreferenceFragment支持,结果Make Project出现此错误。 出现此问题是因为项目未设置Java8的支持,有两种解决方案。 第一种: 在项目的build.gradle文件的android{}节点下,增加如下...
  • Charger Customs 网页web模板 .psd素材下载 PSD、web UI 界面设计、网站模板、网页模板
  • Invoke-customs are only supported starting with Android O (--min-api 26) 解决: build.gradle文件中android节点下增加: compileOptions { sourceCompatibility JavaVersion.VERSION_1_8 ...
  • 莫名遇到的问题:Invoke-customs are only supported starting with Android O (--min-api 26) 使用的构建版本gradle为26。 解决方法:
  • 学习目标 1能用can/cant, be (not) allowed to, have to, be (not) supposed to, doing sth. is (not) allowed, its polite/rude to do等描述规章制度 2能用if, youll.来描述违规的后果 3能用I agree/disagree with,...

空空如也

空空如也

1 2 3 4 5 ... 20
收藏数 3,661
精华内容 1,464
关键字:

customs