精华内容
参与话题
问答
  • android \xxx\libs\ xx.jar系统找不到指定的路径 有可能是需要修改混淆配置。 Eclipse打包时出现export aborted because fatal lint errors were found 参照...

    android \xxx\libs\ xx.jar系统找不到指定的路径

    有可能是需要修改混淆配置。


    Eclipse打包时出现export aborted because fatal lint errors were found

    参照http://stackoverflow.com/questions/8590908/android-export-aborted-because-fatal-error-were-founds
    解决办法:
    Project -> properties, find Android Lint Preferences, in top to right click configure workspace settings... -> unclick "Run full error check when exporting app", apply done.

    工程项目右键 -> Android Tools -> Clean Lint Markers


    Unable to open stack trace file '/data/anr/traces.txt': Permission 多见于这个Activity你没有在AndroidManifest.xml中注册,就会报这样的错误。

    展开全文
  • IDEA导入JAR包引起的错误

    千次阅读 2019-04-13 17:39:43
    所用软件版本: spark2.3.0 kafka 1.10 ...在用IDEA导入kafka JAR包的时候,一直导入不进去,因为spark-streaming-kafka的jar包和kafka的jar包搞混,把org.apache.kafka.clients.consumer.Cons...

    所用软件版本:

      spark2.3.0

      kafka 1.10

      IDEA2019.1(spark-streaming-kafka-0-8-2.11-2.3.0)

    在用IDEA导入kafka JAR包的时候,一直导入不进去,因为spark-streaming-kafka的jar包和kafka的jar包搞混,把org.apache.kafka.clients.consumer.ConsumerRecord写成org.apache.spark.kafka.clients.consumer.ConsumerRecord,多加了个spark,错误以为kafka是spark包里面的!!!

     

    做好记录,供以后参考!!!

     

     

     

    展开全文
  • 怎样在android平台上使用第三方jar包,为什么我在引入了,编译时没有错误,运行时就有错误,报无法实例化错误,请问这是什么原因,本文给于解决方法,需要了解的朋友可以参考下
  • 在maven中导入jar包时出现的错误 错误报告: 在相应文件目录中找不到文件,发现文件名多了一个问号 [INFO] — maven-install-plugin:2.4:install-file (default-cli) @ standalone-pom — [ERROR] The specified ...

    在maven中导入jar包时出现的错误

    错误报告:

    在相应文件目录中找不到文件,发现文件名多了一个问号

    [INFO] — maven-install-plugin:2.4:install-file (default-cli) @ standalone-pom —
    [ERROR] The specified file ‘C:\Users\Administrator\Desktop\lianpay_common_security-0.0.1.jar***?***-DgroupId=lianpay_common_security’ not exists
    [INFO] ------------------------------------------------------------------------
    [INFO] BUILD FAILURE
    [INFO] ------------------------------------------------------------------------
    [INFO] Total time: 1.237 s
    [INFO] Finished at: 2020-03-10T14:34:50+08:00
    [INFO] ------------------------------------------------------------------------
    [ERROR] Failed to execute goal org.apache.maven.plugins:maven-install-plugin:2.4:install-file (default-cli) on project standalone-pom: The specified file ‘C:\Users\Administrator\Desktop\lianpay_common_security-0.0.1.jar?-DgroupId=lianpay_common_security’ not exists -> [Help 1]
    [ERROR]
    [ERROR] To see the full stack trace of the errors, re-run Maven with the -e switch.
    [ERROR] Re-run Maven using the -X switch to enable full debug logging.
    [ERROR]
    [ERROR] For more information about the errors and possible solutions, please read the following articles:
    [ERROR] [Help 1] http://cwiki.apache.org/confluence/display/MAVEN/MojoFailureException

    原因纠正

    在复制命令行代码时,空格键输入错误 将空格键删除后重新输入 编译成功

    成功后:

    C:\Windows\System32>mvn install:install-file -Dfile=“C:\Users\Administrator\Desktop\lianpay_common_security-0.0.1.jar” -DgroupId=lianpay_common_security -DartifactId=lianpay_common_security -Dversion=0.0.1 -Dpackaging=jar
    [INFO] Scanning for projects…
    [INFO]
    [INFO] ------------------< org.apache.maven:standalone-pom >-------------------
    [INFO] Building Maven Stub Project (No POM) 1
    [INFO] --------------------------------[ pom ]---------------------------------
    [INFO]
    [INFO] — maven-install-plugin:2.4:install-file (default-cli) @ standalone-pom —
    [INFO] Installing C:\Users\Administrator\Desktop\lianpay_common_security-0.0.1.jar to E:\jar\lianpay_common_security\lianpay_common_security\0.0.1\lianpay_common_security-0.0.1.jar
    [INFO] Installing C:\Users\ADMINI~1\AppData\Local\Temp\mvninstall1108578841017892212.pom to E:\jar\lianpay_common_security\lianpay_common_security\0.0.1\lianpay_common_security-0.0.1.pom
    [INFO] ------------------------------------------------------------------------
    [INFO] BUILD SUCCESS
    [INFO] ------------------------------------------------------------------------
    [INFO] Total time: 1.795 s
    [INFO] Finished at: 2020-03-10T14:35:26+08:00
    [INFO] ------------------------------------------------------------------------

    展开全文
  • jmeter导入jar包提示错误:ERROR o.a.j.JMeter: Uncaught exception 1、jmeter导入jar包后,运行后 提示如下错误 2020-06-29 11:13:27,506 ERROR o.a.j.JMeter: Uncaught exception: java.lang....

    jmeter导入jar包提示错误:ERROR o.a.j.JMeter: Uncaught exception

    1、jmeter导入jar包后,运行后 提示如下错误
    2020-06-29 11:13:27,506 ERROR o.a.j.JMeter: Uncaught exception:
    java.lang.IncompatibleClassChangeError: Expected static method my.path.kate.getDt(Ljava/lang/String;Ljava/lang/String;)

    2、原因分析
    jar冲突,jmeter加载重复的jar包
    检查、删除如下目录中的重复包,即可

    目录:
    D:\apache-jmeter-5.1.1\apache-jmeter-5.1.1\lib
    D:\apache-jmeter-5.1.1\apache-jmeter-5.1.1\lib\ext

    3、说明

    jmeter的jar包存放目录:
    目录:
    D:\apache-jmeter-5.1.1\apache-jmeter-5.1.1\lib
    D:\apache-jmeter-5.1.1\apache-jmeter-5.1.1\lib\ext

    注:同一个类包,不能重复放在这些目录下
    即使jar包的名称不同,但是classname一样,也不行

    展开全文
  • IDEA导入jar包项目

    2020-07-15 17:27:32
    导入jar包项目详解文章介绍jdk配置 文章介绍 由于导入jar包项目存在很多不确定的问题,导致每次都需要调试、配置好多遍,对此特意记录下来 jdk配置 1.打开配置项 2.选择相应的jdk,1和2最好对应,不然会出现发行版本...
  • eclipse中导入jar包

    2019-10-18 17:01:33
    用build path功能导入jar包 步骤一:找到你想要导入的jar包,ctrl+c 步骤二:点击WEB-INF文件夹–lib文件夹,ctrl+v 步骤三:jar包导入,自动导入到了Web App Libraries中。 步骤四:CTRL+ ALT+O,在引入时在...
  • 工程中导入第三方jar包后,编译没有出错,但运行时出现NoClassDefFoundError,在网上搜了下高手提供的解决方法,有两种: 1、将jar包放在...\Java\jre6\lib\ext目录下,重新编译运行; 2、在Android项目下新建...
  • 我已經导入jar包了,可是该如何import才能使用包里面的class呢?
  • Could not find class 'android.support.v4.view.ViewPager', referenced from method com.maitao.spacepar 有时候,会感觉很多错误遇到过,但是再次遇见的时候,...这不,像这次这个导入Android中自带的这个V...
  • 今天被这个东西坑了好久,后来才找到答案注意web项目 和普通 java项目导入jar包有所不同 ,web项目需要先将要jar包复制到本地磁盘上(文件存放位置就是项目的路径下面WEB-INF/lib这个文件夹下面,如图)我的eclipse...
  • 解决IDEA中maven导入jar包

    万次阅读 2018-05-18 13:47:51
    Libraries如下面没有maven所引入的jar包则为该错误[1]错误原因: 是导入的module错误,应该导入maven的module解 决: File------&gt;Project Structure---------&gt;Modules-----------...
  • 解决方法
  • ideaIU2017 导入jar包

    2017-12-01 14:05:00
    错误方式:这种方法导入jar包,并无法真正被项目调用 File > Project Structure > 方法1:直接将 jar包 复制到项目路径: 项目路径\WebRoot\WEB-INF\lib 方法2:未实测:
  • Android导入JAR包

    2017-03-29 01:13:08
    1、注意导入包到项目时,直接将解压后的jar文件全部复制到libs文件目录下即可,否则运行时会报错。2。同时可通过属性—>JAVA构建路径—>库—>添加外部JAR添加到外部库,便可查看其中函数。 注意,若只做第二步,从...
  • Android怎么导入jar包

    2017-01-15 15:01:29
    当然我所说的有错误是因为没有导入别人项目中的jar包错误,别的错误,就当我没说哈好,言归正传,怎么在eclipse中导入jar包呢?①打开自己的Eclipse,在自己的Android工程上名上右键->Build Path ->Co
  • android studio在误删除jar包之后,执行撤销操作,但是此时一直无法导入成功,也没有报错误信息, 经过排查发现,还原后的jar包是0 kB,所以重新复制一份jar文件导入就OK了 ...
  • ideal 首次使用无法导入jar包问题问题背景描述导入模块添加jar依赖 问题背景描述 换电脑后重新配置JAVA环境,在安装好ideal后并导入了我之前的项目备份,所有jar依赖都下载到本地仓库后,发现一直无法引入jar包依赖...
  • 在做读取word的程序,导包之后一直出现java.lang.NoClassDefFoundError: org.apache.poi.poifs.filesystem.POIFSFileSystem这个问题,一直找不到这个类,不知道是怎么回事
  • 红色感叹号 错误原因:jar 依赖冲突 找到Build Path --> Configure Build Path 删除冲突(这里有两个jar,版本不一致,导致的错误
  • 这两天接手新项目,通过pom.xml导入jar包后,发现工程中依旧存在许多找不到相应包的错误。 多次reimport都是失败 根据包路径去.m2文件夹中查看,发现许多都是空文件,或者jar包不完全 应该是没联网的时候,点击了...
  • )就报错了,看错误日志,以为是导入jar包的问题,后来又有人说可能是参数出错,会提示引入的包报错,让人误以为是引入错误。但我自己真不知道怎么改了,请哪位大神帮我看看是哪里出问题了。[/b] [img=...
  • 由于需要导入jar包,就直接在build path下导入了jar包,并且在java类中也直接通过import也能导入使用,并且单独运行一个java的main类可以正常运行,但是在运行了web项目后,却会报classNotFound的错误,经过后边的查...
  • 这篇文章主要介绍了解决IDEA中maven导入jar包一直报错问题,本文通过实例图文的形式给大家介绍的非常详细,对大家的学习或工作具有一定的参考借鉴价值,需要的朋友可以参考下 查 看: File------>Project ...
  • 错误做法直接将jar包拷贝到本地仓库目录 2、运行mvn install:install-file -Dfile=jar包的路径-DgroupId=gruopId中的内容-DartifactId=actifactId的内容-Dversion=version的内容-Dpackaging=jar 3、如下图导入...
  • 升级IDEA版本,导致项目不识别本地导入jar包。 dependency> groupId>swxagroupId> artifactId>swmailartifactId> version>2.0version> dependency> 提示version 一直红色,提示 inspects a maven model ...
  • 导入jar包出现NoClassDefFoundError

    千次阅读 2012-04-12 12:43:46
    前一段时间还好好的,使用自己的Jar包,没出现过问题。在更新SDK后,升级android... ADT 17对引用的jar有要求,要求jar包要放到项目下的libs里才可以找到,否则apk不会包含该jar包,所以会有类型引用异常的错误。 上

空空如也

1 2 3 4 5 ... 20
收藏数 3,041
精华内容 1,216
关键字:

导入jar包错误