精华内容
下载资源
问答
  • import scipy.io as scio ...无法启动报"ImportError: DLL load failed: 找不到指定的模块"的解决办法 ############################################### 解决办法: 先pip uninstall scipy ...

    import scipy.io as scio
    feat = scio.loadmat(datapath)
    当我运行以上程序的时候,一直报错说:

    无法启动报"ImportError: DLL load failed: 找不到指定的模块"的解决办法

    ###############################################
    解决办法:
    先pip uninstall scipy 先卸载了
    再安装vc++:visual c++ redistributable for visual studio 2015
    安装好了之后再重新 pip install scipy

    我之前就是没有卸载scipy直接装的vc++,一直都没有成功/

    展开全文
  • 解决matlab 2014b的Test checkout of feature 'Compiler' failed

    千次下载 热门讨论 2016-05-24 20:13:07
    解决matlab 2014b的Test checkout of feature 'Compiler' failed. 以上错误据说是因为2014b破解不完全引起的。
  • Debug Assertion Failed!查找问题所在方法

    万次阅读 2018-04-20 09:17:03
    Debug Assertion Failed!查找问题所在行

    网上也都说了这是野指针或者内存泄漏问题,但是并没有说明或者我没有找到,关于如何查找哪里(哪一行)出现了内存泄漏的相关方法。毕竟总不能在成千上万中审阅自己的代码吧!

    方法很简单
    1、点击“忽略”。以前代码少,都是点击“中止”后靠肉眼查找(方法很笨,效果不好)
    这里写图片描述

    2、此时会出现异常窗口,点击“中断”。
    这里写图片描述

    3、在“调用堆栈”窗口中就能找到自己出现问题在哪一行了(堆栈平衡原理)。
    这里写图片描述

    4、最后作者定位的中断行
    这里写图片描述

    展开全文
  • vbsedit Failed to load pdm.dll解决办法.

    热门讨论 2013-02-21 00:04:47
    vbsedit Failed to load pdm.dll解决办法. 带有详细的使用说明 安装 vbsedit 运行时 来提示vbsedit Failed to load pdm.dll 千辛万苦找到的 很好用的解决办法
  • Gradle sync failed: Sync failed: reason unknown

    千次阅读 2021-08-31 18:43:03
    但是,还是同步失败:Gradle sync failed: Sync failed: reason unknown 只能通过查看studio log了。log路径:C:\Users\(真实用户名)\AppData\Local\Google\AndroidStudio2020.3\log\idea.log 可以看到: 2021-08-...

    升级Android Studio到最新稳定版2020.03.1后,一直提示同步失败。顶部中间的设备框显示灰色的“no device”。

    查看Event log,有个黄色提示:

    Project ecplyx_hfyh is using the following JDK location when running Gradle:
            D:/Program Files/Android/Android Studio/jre
            Using different JDK locations on different processes might cause Gradle to
            spawn multiple daemons, for example, by executing Gradle tasks from a terminal
            while using Android Studio.

            More info...
            Select a JDK
            Do not show this warning again

    设置JAVA-HOME JDK_HOME和CLASS_PATH三个环境变量, 都指向Studio默认的jdk(默认jdk11)。重新同步工程,上面的提示不再复现。但是,还是同步失败:Gradle sync failed: Sync failed: reason unknown

    只能通过查看studio log了。log路径:C:\Users\(真实用户名)\AppData\Local\Google\AndroidStudio2020.3\log\idea.log

    可以看到:

    2021-08-31 18:15:41,203 [2785643]   WARN - ea.gradle.project.sync.SdkSync - Module: 'XXXX' platform 'android-30' not found. 

    以自己实际编译的日志为准。这边出现问题的原因从日志看,是缺少platform 'android-30',从setting->sdk 中下载platform 'android-30',重新同步。

    工程同步成功了,问题就解决了。

    大家遇到类似问题,一般都可以通过C:\Users\(真实用户名)\AppData\Local\Google\AndroidStudio2020.3\log\idea.log这个日志反馈来解决。

    展开全文
  • resource failed to call close

    千次阅读 2021-05-26 11:27:30
    在运行Android项目时,日志中会出现A resource failed to call close告警信息: 2021-05-26 11:26:52.564 11386-11401/com.xxx.example W/System: A resource failed to call close. 这是由于文件输入和输出流在...

    在运行Android项目时,日志中会出现A resource failed to call close告警信息:

    2021-05-26 11:26:52.564 11386-11401/com.xxx.example W/System: A resource failed to call close. 
    

    这是由于文件输入和输出流在调用后没有及时close导致的,需要在调用后手动close掉输入输出流

    try {
    			FileInputStream fis = new FileInputStream(path);
    			FileChannel channel = fis.getChannel();
    			ByteBuffer byteBuffer = ByteBuffer.allocate((int) channel.size());
    			while ((channel.read(byteBuffer)) > 0) {
    				// do nothing
    			}
    			byte[] dataByte = byteBuffer.array();
    			channel.close(); //这里需要关闭channel,否则就会打印A resource failed to call close
    			return dataByte;
    		} catch (Throwable t) {
    		}
    
    展开全文
  • Android studio升级到北极狐版本(2020.3.1 for Mac)后,导入新项目编译,同步失败,如图: 回退到【4.2.1 正式版】就好了,附上Android studio历史版本下载地址
  • Docker: failed to export iamge: failed to create image: failed to get layer 概述 在执行docker多阶构建的时候,偶尔会出现 failed to get layer 的错误 dockerfile ## 仅供参考,不一定触发场景 FROM alpine:...
  • initramfs unpacking failed: Decoding failed 然后,就出现部分花屏现象,就卡住了。无法进入到安装界面 这个好像是Nvidia显卡的问题。 在GRUB 模式(即进入U盘准备安装ubuntu)下选择ubuntun 前要按下 E 之后...
  • Debug Assertion Failed!问题怎么解决?

    热门讨论 2011-02-25 20:04:04
    Debug Assertion Failed!
  • 是参数保存出了问题,将前面训练的参数,删除,并在重新训练,同时,在保存参数的地方添加
  • Docker failed to initialize

    千次阅读 多人点赞 2021-07-14 08:55:04
    这种情况不用重装docker; 将 C:\Users\Administrator\AppData\Roaming 目录(这个目录根据每个人电脑安装docker的位置而定我的目录是:C:\Users\xin_y\AppData\Roaming)下Docker目录改名为Docker_backup(实际上...
  • 用pystaller 生成的exe文件,双击运行时出现failed to execute script错误, 求大神帮忙,到底是什么原因。网上没查到,基本也有什么路径的问题。很简单的一段代码 代码如下 # -*- coding: utf-8 -*- #根据...
  • pull access denied, repository does not exist or may require authorization: server message: insufficient_scope: authorization failed 解决 虽然我选择阿里云的地址是深圳,可是from基础镜像的时候还是要...
  • 删除数据库 Caused by: org.flywaydb.core.api.FlywayException: Validate failed: Detected failed migration to version 0.1.3
  • rke up --config config/ rancher.yml 原因可能是master节点的集群ip映射了5台机器,实际master...Readiness probe failed: HTTP probe failed with statuscode: 503 依然出现 百度方案 kubectl get comp...
  • FAILED: SemanticException Failed to breakup Windowing invocations into Groups. At least 1 group must only depend on input columns. Also check for circular dependencies. 我的代码如下(这里举个例子,...
  • 在使用Vue封装UI组件时,...Module parse failed: Unexpected character '' (1:4) You may need an appropriate loader to handle this file type. 初步判断是webpack的配置里缺少了对字体文件的处理,经过多次尝试最.
  • Unity Failed to resolve project template:Failed to decompress问题描述解决方案 问题描述 似乎是导致新项目路径的长度。在我的测试中,当到新项目根目录的路径的总长度小于等于76时,就可以创建该项目。当长度&...
  • Git failed with a fatal error. Authentication failed问题根源解决方案 问题根源 Windows凭证管理器保存的git账号凭证,即git密码错误 解决方案 逛了一下github,已经有人给出了解决方案: 链接: 具体做法:...
  • 请求状态failed

    万次阅读 2019-04-23 10:01:23
    今天遇到一个问题记录一下,有一个客户反映公司网站刷新首页的时候一直提示一个错误,远程查看了之后发现是广告请求失败了,其他请求都没有问题,f12看改广告请求的status是failed,找了半天才发现是360浏览器识别...
  • conda安装库时报错: conda install keras Collecting package metadata (current_repodata....Solving environment: failed with initial frozen solve. Retrying with flexible solve. Solving environment: fai...
  • 解决Host key verification failed.(亲测有效)

    万次阅读 多人点赞 2019-01-02 20:56:21
    Host key verification failed. 这里面,有一句很关键。 ECDSA host key for 108.61.163.242 has changed and you have requested strict checking. Host key verification failed. 一般这个问题,是你重置...
  • 在使用Genymotion模拟器调试App时出现Installation failed with message INSTALL_FAILED_NO_MATCHING_ABIS: Failed to extract no extract native libraries 错误,如下图所示:
  • 以前的老项目今天运行,运行不了,微信...exception: register app failed for wechat app signature check failed 支付时: IWXAPI wxapi = WXAPIFactory.createWXAPI(this,WXAPPID,true); 替换为 IWXAPI wxapi = ...
  • git push推送时报错: ...fatal: unable to access ‘https://github.com/i042416/KnowlegeRepository.git/’: schnnel: failed to receive handshake, SSL/TLS connection failed 解决方案 git配置文件里加上一...
  • pngquant pre-build test failed

    千次阅读 2020-01-14 16:22:48
    pngquant pre-build test failed. Error:pngquant failed to build,make sure that libpng-dev is installed. 不得不说,Error信息让我走了弯路,找了好久的libpng-dev这个库。 折腾了半天都不行,找到了pngquant...
  • DLL load failed while importing _imaging

    千次阅读 多人点赞 2020-12-06 11:01:36
    问题背景:DLL load failed while importing _imaging: 找不到指定的模块。 解决办法:(我是这么解决的,供参考) 这是pillow官网贴出来的和python对应关系: 我是python3.8,然后卸载了原来的pillow,...

空空如也

空空如也

1 2 3 4 5 ... 20
收藏数 1,094,123
精华内容 437,649
关键字:

failed