精华内容
下载资源
问答
  • 解决Android killer APK 编译失败,无法继续下一步签名
    2021-06-02 14:31:10

    报错特征

    自己使用AndroidStudio生成了一个Demo App,用来测试Androd killer的反编译的功能,结果报错了,报错信息如下:

    > ... 14 more

    APK 编译失败,无法继续下一步签名!

    解决方式

    解决方式一 删除报错文件

    解决方式二 换个AndroidStudio版本编译

    如果是自己生成的APK,可以考虑更换一下IDE版本,我当时编译时使用的AndroidStudio版本为3.2.1,就下载一个低版本的android studio2.2.3、 SDK API 16,解决了这个问题。具体原理没有分析。

    看网上还有人说JDK的版本也有影响,和这个没有关系,我特意做了实验,切换1.7和1.8的JDK都能编译出来。

    一些实验

    其实这个问题不算解决,上面说的都是用一些奇技淫巧避过一下。我后来使用了AndroidStudio版本为3.3.3的生成一个release包,也能正常二次编译,替换签名。这就很奇怪了,不同AndroidStudio版本的打出来的包,在AndroidKiller上有的能的编译成功、有的编译失败,这个问题就有点复杂了,先搁置吧。

    更多相关内容
  • TIA博途 Wincc的触摸屏编译时报错,编译失败,请联系SIEMENS客户支持部门_解决办法汇总
  • 威纶通触摸屏编译失败,提示LOCAL HMI数据保护,设备地址超出限制范围
  • 威纶触摸屏使用U盘或SD卡上传或下载程序步骤及编译失败处理对策
  • autoware安装,编译失败后用于替换安装包文件保证顺利编译。内含使用说明。。。。。。。。。。。。。
  • Android killer 回编译失败

    千次阅读 2022-04-27 20:14:38
    正在编译 APK,请稍等... >I: Using Apktool 2.2.3 >I: Smaling smali folder into classes.dex... >I: Building resources... >W: invalid resource directory name: D:\AndroidKiller_v1.3.1\projects...

    当前 Apktool 使用版本:apktool_2.6.1
    正在编译 APK,请稍等...
    >I: Using Apktool 2.6.1
    >I: Smaling smali folder into classes.dex...
    >I: Building resources...
    >W: invalid resource directory name: D:\AndroidKiller_v1.3.1\projects\app-release\Project\res navigation
    >ion, 30, --version-code, 1, --version-name, 1.0, --no-version-vectors, -F, C:\Users\ADMINI~1\AppData\Local\Temp\APKTOOL4241434743212377043.tmp, -e, C:\Users\ADMINI~1\AppData\Local\Temp\APKTOOL6406967134532636125.tmp, -0, arsc, -I, C:\Users\Administrator\Apion, 30, --version-code, 1, --version-name, 1.0, --no-version-vectors, -F, C:\Users\ADMINI~1\AppData\Local\Temp\APKTOOL4241434743212377043.tmp, -e, C:\Users\ADMINI~1\AppData\Local\Temp\APKTOOL6406967134532636125.tmp, -0, arsc, -I, C:\Users\Administrator\AppData\Local\apktool\framework\1.apk, -S, D:\AndroidKiller_v1.3.1\projects\app-release\Project\res, -M, D:\AndroidKiller_v1.3.1\projects\app-release\Project\AndroidManifest.xml]
    APK 编译失败,无法继续下一步签名!

    产生原因
    aapt2才支持navigation ,而AndroidKiller默认采用aapt

    回编译命令行指定aapt2 即可

    D:\AndroidKiller_v1.3.1\bin\apktool\apktool>java -jar apktool_2.6.1.jar b myapplication -o myapplication.apk --use-aapt2

    展开全文
  • Android 资源编译失败

    千次阅读 2022-02-07 10:16:36
    错误提示代码:ERROR: Android resource compilation failed AAPT: error: <item> inner element must either be a resource reference or empty ... ...item type="id" name="ChkAppNewVercode_bg">...

    错误提示代码:ERROR: Android resource compilation failed

    AAPT: error: <item> inner element must either be a resource reference or empty

    直接点击报错的连接-->

    <item type="id" name="ChkAppNewVercode_bg">false</item>  -->

    直接修改为

    <item type="id" name="ChkAppNewVercode_bg"/>即可

    day  day  up!

    展开全文
  • 在反向解析APP包时报错:APK 编译失败,无法继续下一步签名。 网上很多方法都是无效的哈,我追究原因发现,这个bug的出现大部分情况都是因为Apktool的问题。 此方法:百分之百解决此bug! 错误如下: 问题描述 APK...

    一,AndroidKille解析报错如下:

    AndroidKiller:
    在反向解析APP包时报错:APK 编译失败,无法继续下一步签名。
    网上很多方法都是无效的哈,我追究原因发现,这个bug的出现大部分情况都是因为Apktool的问题。
    此方法:百分之百解决此bug!
    错误如下:
    在这里插入图片描述


    二,问题描述

    APK 编译失败,无法继续下一步签名!

    三,报错原因分析:

    Apktool版本不适配的问题,现在的技术更新换代太快,我们安装AndroidKiller的时候,有时候不是官方渠道的话,他的版本是非常老旧的,安装的时候会有一个自动推荐的Apktool,它可能特别的老旧。
    解决方法如下:

    四,解决方案:BUG解决

    跳转到最新apktool更新网站:直通车:

    https://bitbucket.org/iBotPeaches/apktool/downloads/
    

    点击Apktool管理器:
    在这里插入图片描述

    下载最新的Apktool:点击跳转。
    在这里插入图片描述
    点击Android killer 1.3.1 个人修改版【最新的即可】
    在这里插入图片描述
    点击跳转到最新apktool更新网站:
    在这里插入图片描述
    点击就可以下载了!
    在这里插入图片描述
    下载的本地,我下载到了桌面:
    在这里插入图片描述
    点击打开“”
    在这里插入图片描述

    点击确定。
    在这里插入图片描述
    找到刚刚的添加版本。

    重新解析app包。

    就会发现问题完美解决!

    展开全文
  • TIA博途Wincc的触摸屏编译时报错,编译失败,请联系SIEMENS客户支持部门_解决办法汇总
  • thingsboard编译,物联网
  • maven 编译成功但是 IDEA 编译失败

    千次阅读 2021-02-01 14:11:14
    发现一个问题,我的工程某个模块 maven 编译能成功,但是 IDEA 编译一直失败。 参考: https://stackoverflow.com/questions/18316857/maven-package-works-but-intellijs-build-fails 先删除相应模块的 .impl 文件...
  • 今天使用AndroidKiller V1.3.1,反编译一个APK,遇到如下报错: 当前 Apktool 使用版本:Android Killer Default APKTOOL 正在反编译 APK,请稍等... >I: 使用 ShakaApktool 2.0.0-20150914 >I: 正在加载资源...
  • godot 编译失败

    千次阅读 2022-01-14 21:50:34
    godot编译时C:\Program Files\Microsoft SDKs\Windows\v6.0A\Include\ShlObj.h编译失败
  • 解决办法: file - > settings - > java complier —>找到项目模块 将目标字节码版本 全都改成 1.8 即可
  • UE4创建c++项目编译失败

    千次阅读 2021-02-05 13:43:03
    直接下载安装ue4,ue4版本 4.26.1创建c++空项目到67%,编译失败 到这就完啦,不能直接打开。 尝试用vs2019打开sln,在vs生成后,再启动项目可以正常打开 错误代码网上查询仿佛是虚拟内存不够
  • 在运行的时候,按照官方指示在工具栏里面打开在浏览器里面运行,一直提示编译失败,心累的找了一上午是为什么,而且新手一开始貌似遇到这种问题,挺多的 原因: 1: 你运行的时候提示你要去安装插件但是一直报网络...
  • 使用HBuilderX运行H5 编译失败

    千次阅读 2019-09-23 15:11:03
    在使用HBuilderX运行H5 小程序代码时出现编译失败, 如果是从git上边下载到本地 再倒入到 HBuilderX中时, 有可能是没有 node_modules 这个文件, 你可以从原先的项目里copy一个文件放在运行的项目里 再次启动即可...
  • maven项目编译失败,解决方案

    千次阅读 2020-12-29 21:04:57
    那就定义jar (默认就为jar,可以不定义) 情况二: 有代码的maven项目,通常要指定 maven编译环境,同时电脑的jdk环境,要与这插件的编译、打包环境一致。 不然有可能会出现一些问题,但不是绝对的。 通常报错: ...
  • Test, 在iPhone设备上运行WebDriverAgentRunner,提示编译失败(build failed) 但是没有任何其他报错 原因 工程有Error,在菜单栏切换下视图 选择 View下 Navigators切换到 Report 就可以看到报错详情了 点击报错...
  • 微信小程序编译失败,提示编译失败,版本需要升级 第一次新建的小程序项目,就提示编译失败,版本不匹配,要升级版本。 解决方法: 新建小程序,一定要放在空白文件夹路径下,一定要选择项目的类型为快速启动项目...
  • android 10.0 ram包太大导致ota编译失败

    千次阅读 2022-01-06 09:08:14
    在10.0中,由于内置的app较多,结果导致ota编译总是失败编译不出来ota 升级包,确实挺麻烦,也找不到什么具体原因 最后问了下ota sdk公司 才慢慢得到解决方法 1.build 下 common.py的相关文件的修改 接下来看具体...
  • 这里也不要着急,也是需要时间的 接着,进入到build文件夹下 cd opencv-3.4.1 ls cd build sudo make -j4 (后面的数字是编译线程数,加快编译速度的,看自己配置) 这里可能会出现几个错误,一般情况下都是文件路径用...
  • 使用lombok后,项目编译失败

    千次阅读 2019-09-30 18:06:30
    问题:如题,maven中引用lombok 工具后,编译失败。 原因:maven-compiler-plugin 版本过低。 解决:pom文件中指定 maven-compiler-plugin 版本为 3.8.0 后编译成功。 转载于:...
  • Android studio gradle编译失败问题汇总

    千次阅读 2019-06-06 11:16:46
    而出现问题最集中的莫过于让人头疼的gradle编译问题,由于Android studio使用的是一个在线的国外编译系统『gradle』,因此在连接外网进行下载必要的编译资源时会不可避免的出现一些问题; 根据日常开发&翻贴...
  • ![图片说明](https://img-ask.csdn.net/upload/201907/23/1563814826_997461.png)这个程序在vs2015可以运行
  • Uboot 编译失败问题

    千次阅读 2020-09-02 18:27:13
    编译失败问题汇总 索引一、已经有uboot源码,并且有 build.sh 的情况。 一、已经有uboot源码,并且有 build.sh 的情况。 首先Makefile 没有配置编译器,导致的错误,错误提示信息如下: cc1: error: bad value (armv...
  • 自动编译(\static_project\css\basic.scss)失败: Errno::ENOENT: No such file or directory @ rb_sysopen - –no-cache Use --trace for backtrace.
  • 编译失败:内部java编译器错误

    千次阅读 多人点赞 2020-03-27 23:15:07
    idea编译java报错 信息:Eclipse编译器4.6.2用于编译java源 信息:模块sinoWeb由于项目配置/依赖项...错误:java:编译失败:内部java编译器错误 解决方案 file - > settings - > java complier —>找到...
  • 威纶通触摸屏编译失败,提示LOCAL HMI数据保护,设备地址超出限制范围 使用威纶触摸屏时碰到这样一个问题: 即从屏幕上传的程序,反编译是正常的,但是上传上来之后,用easybuilder再次编译时却提示编译失败,而且...
  • 问题:UE4.25新建C++项目时编译失败,显示???文件。 原因:无法识别中文项目名称。 解决:将项目名称改为英文数字等字母。

空空如也

空空如也

1 2 3 4 5 ... 20
收藏数 540,930
精华内容 216,372
关键字:

编译失败

友情链接: VLSI-UNIV-LAB-2010.rar